{"text_format":"1","workbook":"xlsx","n_sheets":11,"sheets":["Instructions","Before","After","Original","Water Savings Estimate","Background Info and Assumptions","CA ET Zone Map","B Calcs","Calcs","Reporting","Password"],"not_rendered":{"charts":0,"images":6,"macros":1,"external_links":0,"defined_names":11,"comments":1,"pivot_tables":0},"unopened":[],"bounds":{"document_bytes":16777216,"sheet_cells":100000,"rows_first":2000,"rows_last":500,"rows_between":2000,"halvings":0,"cell_chars":16384,"cell_head_chars":4096},"cells_cut":0,"cells_raw":0,"read":"whole","date_system":"1900"}

{"sheet":"Instructions","index":0,"n_rows":0,"n_cols":0,"rows_kept":0,"cut":false,"hidden":false,"merged":[]}

{"sheet":"Before","index":1,"n_rows":28,"n_cols":9,"rows_kept":28,"cut":false,"hidden":false,"merged":[[36,2,37,2],[0,0,0,8],[2,1,2,2],[3,1,3,4],[18,0,18,1],[20,0,20,1],[33,3,34,3],[33,5,34,5],[33,7,34,8],[1,0,1,8]]}
["SWEEP Irrigation Water Savings Assessment Tool"]
["The \"before\" scenario tab represents the baseline situation on the field. Complete this tab to represent the \"pre-project\" conditions. An estimate of baseline water use will be calculated based upon the field location, soil type, and irrigation method."]
["Applicant:",null,null,"Application ID:",null,null,null,"Date:"]
["Field or Ranch Name:",null,null,null,null,null,null,"Impacted Acres:"]
[]
[]
[null,null,null,null,null,null,null,"ET Zone",{"$f":"'B Calcs'!H105","v":16}]
[]
[]
[]
[]
[]
[]
[]
[]
[]
[]
[]
["Estimated \"before\" water use",null,{"$f":"IF(ISERROR('B Calcs'!AB1),0,'B Calcs'!AB1)","v":105},"  Ac-in/Ac"]
[]
["Estimated after practice water use   ",null,{"$f":"IF(ISERROR('B Calcs'!AE1),0,('B Calcs'!AE1)-'B Calcs'!AE1*'B Calcs'!AV2)","v":94.5},"  Ac-in/Ac"]
[]
["Annual Water Savings Estimate"]
[{"$f":"IF(ISERROR('B Calcs'!AB1-'B Calcs'!AE1),0,C19-C21)","v":10.5},"Ac-in/Ac",{"$f":"'B Calcs'!C111","v":""}]
[]
[{"$f":"IF(C19=0,0,(C19-C21)/C19*100)","v":10},"%",{"$f":"IF(C21=0,\"\",'B Calcs'!BO1)","v":0.31},{"$f":"IF(C21=0,\"\",\"In. Peak Daily ET\")","v":"In. Peak Daily ET"},{"$f":"'B Calcs'!BR1","v":""}]
[]
[{"$f":"('B Calcs'!AH1)","v":"ET Based on NRCS state office Aug,2000 (annual) (planting 1/1 and harvesting 12/31)"}]

{"sheet":"After","index":2,"n_rows":28,"n_cols":9,"rows_kept":28,"cut":false,"hidden":false,"merged":[[0,0,0,8],[18,0,18,1],[33,7,34,8],[36,2,37,2],[33,3,34,3],[33,5,34,5],[20,0,20,1],[3,1,3,4],[2,1,2,2],[1,0,1,8]]}
["SWEEP Irrigation Water Savings Assessment Tool"]
["The \"after\" scenario tab represents the desired situation on the field. Complete this tab to represent the \"post-project\" conditions. An estimate of projected water use will be calculated based upon the field location, soil type,  irrigation method, and change in the level of irrigation management. See the instruction tab for more information on the levels of water management."]
[]
[]
[]
[]
[null,null,null,null,null,null,null,"ET Zone",{"$f":"Calcs!H111","v":16}]
[]
[]
[]
[]
[]
[]
[]
[]
[]
[]
[]
["Estimated before practice water use",null,{"$f":"IF(ISERROR(Calcs!AB1),0,Calcs!AB1)","v":105},"  Ac-in/Ac"]
[]
["Estimated \"after\" water use   ",null,{"$f":"IF(ISERROR(Calcs!AE1),0,(Calcs!AE1)-Calcs!AE1*Calcs!AV2)","v":105},"  Ac-in/Ac"]
[]
["Annual Water Savings Estimate"]
[{"$f":"IF(ISERROR(Calcs!AB1-Calcs!AE1),0,C19-C21)","v":0},"Ac-in/Ac",{"$f":"Calcs!C117","v":""}]
[]
[{"$f":"IF(C19=0,0,(C19-C21)/C19*100)","v":0},"%",{"$f":"IF(C21=0,\"\",Calcs!BO1)","v":0.31},{"$f":"IF(C21=0,\"\",\"In. Peak Daily ET\")","v":"In. Peak Daily ET"},{"$f":"Calcs!BR1","v":""}]
[]
[{"$f":"(Calcs!AH1)","v":"ET Based on NRCS state office Aug,2000 (annual) (planting 1/1 and harvesting 12/31)"}]

{"sheet":"Original","index":3,"n_rows":88,"n_cols":21,"rows_kept":88,"cut":false,"hidden":true,"merged":[[17,13,18,14],[28,0,28,3],[28,6,28,7],[23,1,23,2],[28,13,28,14],[28,9,28,10],[28,11,29,12],[26,13,26,14],[24,13,24,14],[24,9,24,10],[20,9,20,12],[78,1,78,18],[47,15,47,16],[47,1,47,2],[47,3,47,4],[47,9,47,10],[47,13,47,14],[47,17,47,18],[35,0,35,18],[37,3,37,13],[43,0,43,18],[25,6,25,7],[24,11,25,12],[31,8,31,10],[39,3,39,12],[38,3,38,13],[29,6,29,7],[30,13,31,14],[31,11,31,12],[0,20,0,21],[81,0,83,18],[80,0,80,18],[13,13,14,14],[15,13,16,14],[46,1,46,18],[23,11,23,12],[28,4,29,5],[24,6,24,7],[24,0,24,4],[0,0,0,18],[2,0,2,18],[1,0,1,18],[11,13,11,14],[20,13,20,14],[13,1,14,10],[84,0,85,18],[8,15,9,18],[5,15,6,18],[8,1,9,10],[5,1,6,2],[5,5,6,13],[11,1,11,10],[9,11,9,14],[23,5,23,10],[17,1,18,10],[15,1,16,10],[6,3,6,4],[24,5,25,5],[47,11,47,12],[47,5,47,6],[47,7,47,8]]}
["EQIP IRRIGATION PRACTICES",null,null,null,null,null,null,null,null,null,null,null,null,null,null,null,null,null,null,null,"INPUT CELLS"]
["Estimated Water Conserved"]
["(Acre Inches Per Acre)"]
[]
[]
[]
["Applicant  No.:",null,null,"Applicant:",null,null,null,null,null,null,null,null,null,null,"Date:"]
[]
[]
["Practice:",null,null,null,null,null,null,null,null,null,null,"Predominant Soil Texture:"]
[]
[null,"Crop(s) *",null,null,null,null,null,null,null,null,null,null,null,"ETc (in.) **"]
[]
[]
[]
[]
[]
[]
[]
[]
[null,null,null,null,null,null,null,null,null,"Total Annual ETc (in.) =  ",null,null,null,{"$f":"SUM(N14:O19)","v":0},null,"in"]
[]
[]
[]
["Estimated Amount of Water Applied BEFORE Practice:",null,null,null,null,"Wb =","ETc",null,null,{"$f":"N21","v":0},null,"=",null,{"$f":"IF(J26>0,J25/J26,0)","v":0}]
[null,null,null,null,null,null,"Eb/100",null,null,null,"/100"]
[]
[]
["Estimated Amount of Water Applied AFTER Practice:",null,null,null,"Wa =",null,"ETc",null,null,{"$f":"N21","v":0},null,"=",null,{"$f":"IF(J30>0,J29/J30,0)","v":0}]
[null,null,null,null,null,null,"Ea/100",null,null,null,"/100"]
[null,null,null,null,null,null,null,null,null,null,null,null,null,{"$f":"N25-N29","v":0}]
["Estimated Annual Water Savings:",null,null,null,null,null,null,null,"Wb - Wa",null,null,"=",null,null,null,"ac-in/ac"]
[]
[]
[]
["EXAMPLE: Replace an unlined ditch with a pipeline in a furrow irrigation system.  The soil is a loam and the annual ETc is 31 in."]
[]
["ETc = 31 in",null,null,"Estimated water applied BEFORE = Wb = ETc/(Eb/100) = 31/0.71 = 43.7"]
["Efficiency BEFORE = Eb = 71%",null,null,"Estimated water applied AFTER = Wa = ETc/(Ea/100) = 31/0.78 = 39.7"]
["Efficiency AFTER = Ea = 78%",null,null,"Estimated water savings = Wb - Wa = 43.7 - 39.7 = 4.0 ac-in/ac"]
[]
[]
[]
["SUGGESTED BEFORE (Eb) AND AFTER (Ea) SYSTEM EFFICIENCIES ***"]
[]
[]
[null,"Predominant Soil Texture"]
["PROPOSED IRRIGATION METHOD","s",null,"ls",null,"sl",null,"fsl",null,"l",null,"sil",null,"cl",null,"c",null,"organic"]
["Proposed Cost-Shared Practice","Eb","Ea","Eb","Ea","Eb","Ea","Eb","Ea","Eb","Ea","Eb","Ea","Eb","Ea","Eb","Ea","Eb","Ea"]
["SURFACE IRRIGATION"]
["Replace unlined ditch with pipeline/lining",0.45,0.6,0.52,0.65,0.59,0.7,0.67,0.74,0.71,0.78,0.73,0.78,0.75,0.78,0.75,0.78,0.52,0.65]
["SURFACE IRRIGATION"]
["Replace a leaky pipeline with a pipeline",0.5,0.6,0.55000000000000004,0.65,0.61,0.7,0.68,0.74,0.72,0.78,0.74,0.78,0.76,0.78,0.76,0.78,0.55000000000000004,0.65]
["SURFACE IRRIGATION"]
["Improve DU (Split runs, higher Q, etc.)",0.43,0.6,0.48,0.65,0.54,0.7,0.57999999999999996,0.74,0.64,0.78,0.64,0.78,0.64,0.78,0.64,0.78,0.48,0.65]
["SURFACE IRRIGATION"]
["Install a tailwater recovery system",0.53,0.6,0.56000000000000005,0.65,0.57999999999999996,0.7,0.6,0.74,0.61,0.78,0.61,0.78,0.62,0.78,0.62,0.78,0.56000000000000005,0.65]
["SURFACE IRRIGATION"]
["Landleveling (previously leveled)",{"$f":"$C59*0.9","v":0.54},0.6,0.59,0.65,0.63,0.7,0.67,0.74,0.7,0.78,0.7,0.78,0.7,0.78,0.7,0.78,0.59,0.65]
["SURFACE IRRIGATION"]
["Landleveling (previously unleveled)",0.48,0.6,0.52,0.65,0.56000000000000005,0.7,0.59,0.74,0.62,0.78,0.62,0.78,0.62,0.78,0.62,0.78,0.52,0.65]
["SPRINKLER IRR. (Hand Move/Side Roll)"]
["Replace surface irrigation",0.43,0.73,0.48,0.73,0.54,0.73,0.56000000000000005,0.73,0.61,0.73,0.61,0.73,0.62,0.73,0.62,0.73,0.48,0.73]
["SPRINKLER IRR. (Solid Set, Undertree)"]
["Replace surface irrigation",0.43,0.8,0.48,0.8,0.54,0.8,0.56000000000000005,0.8,0.61,0.8,0.61,0.8,0.62,0.8,0.62,0.8,0.48,0.8]
["SPRINKLER IRR. (Solid Set, Undertree)"]
["Replace hand move sprinkler",0.73,0.8,0.73,0.8,0.73,0.8,0.73,0.8,0.73,0.8,0.73,0.8,0.73,0.8,0.73,0.8,0.73,0.8]
["TRICKLE IRRIGATION"]
["Replace surface irrigation",0.43,0.85,0.48,0.85,0.54,0.85,0.56000000000000005,0.85,0.61,0.85,0.61,0.85,0.62,0.85,0.62,0.85,0.48,0.85]
["TRICKLE IRRIGATION"]
["Replace under tree, solid set sprinkler ",0.8,0.85,0.8,0.85,0.8,0.85,0.8,0.85,0.8,0.85,0.8,0.85,0.8,0.85,0.8,0.85,0.8,0.85]
["TRICKLE IRRIGATION"]
["Replace hand move sprinkler",0.73,0.85,0.73,0.85,0.73,0.85,0.73,0.85,0.73,0.85,0.73,0.85,0.73,0.85,0.73,0.85,0.73,0.85]
["CENTER PIVOTS"]
["Replace surface irrigation",0.43,0.8,0.48,0.8,0.54,0.8,0.56000000000000005,0.8,0.61,0.8,0.61,0.8,0.62,0.8,0.62,0.8,0.48,0.8]
["CENTER PIVOTS"]
["Replace wheel lines",0.73,0.8,0.73,0.8,0.73,0.8,0.73,0.8,0.73,0.8,0.73,0.8,0.73,0.8,0.73,0.8,0.73,0.8]
["OTHER"]
[null,"Seek assistance from your Area Engineer.  Document procedures and source of values."]
[]
["*       List crop, multiple crops each calendar year, or crops in a typical rotation.  If there is a permanent crop change, only list the new crop."]
["**     Used here as an approximation of the net water requirement.  Effective precipitation or salt leaching and other  beneficials water uses are not accounted for.  For crops in rotation, calculate a weighted average ETc for a rotation cycle.  If there is a permanent crop change, use the ETc of the new crop.  Include cover crop ETc if applicable."]
[]
[]
["***   For estimating water savings associated with the EQIP program. These values can be used to represent cost-share applicant conditions.  For surface irrigation, values apply to systems on uniform slopes."]
[]
[]
["NRCS, Davis, CA, 6/25/03"]

{"sheet":"Water Savings Estimate","index":4,"n_rows":6,"n_cols":7,"rows_kept":6,"cut":false,"hidden":false,"merged":[[0,0,0,8]]}
["SWEEP Irrigation Water Savings Assessment Tool"]
[]
[null,"Estimated \"Before\" Scenario Water Use",null,null,null,{"$f":"VALUE(Before!C19)","v":105},"ac-in/ac"]
[null,"Estimated \"After\" Scenario Water Use",null,null,null,{"$f":"VALUE(After!C21)","v":105},"ac-in/ac"]
[null,"Annual Estimated Water Savings",null,null,null,{"$f":"F3-F4","v":0},"ac-in/ac"]
[null,"Percent Water Savings",null,null,null,{"$f":"IF(F3=0,0,(F3-F4)/F3*100)","v":0},"%"]

{"sheet":"Background Info and Assumptions","index":5,"n_rows":0,"n_cols":0,"rows_kept":0,"cut":false,"hidden":false,"merged":[]}

{"sheet":"CA ET Zone Map","index":6,"n_rows":0,"n_cols":0,"rows_kept":0,"cut":false,"hidden":true,"merged":[]}

{"sheet":"B Calcs","index":7,"n_rows":231,"n_cols":131,"rows_kept":231,"cut":false,"hidden":true,"merged":[]}
[null,"Zone Selection",{"$f":"H105","v":16},null,"Crop",1,null,"Practice",1,null,"Soil",1,null,"Etc",{"$f":"IF(C1=1,LOOKUP(F1,A5:A67,C5:C67), IF(C1=2,LOOKUP(F1,A5:A67,D5:D67),IF(C1=3,LOOKUP(F1,A5:A67,E5:E67),IF(C1=4,LOOKUP(F1,A5:A67,F5:F67), IF(C1=5,LOOKUP(F1,A5:A67,G5:G67), IF(C1=6,LOOKUP(F1,A5:A67,H5:H67),P1))))))","v":63},{"$f":"IF(C1=7,LOOKUP(F1,A5:A67,I5:I67), IF(C1=8,LOOKUP(F1,A5:A67,J5:J67),IF(C1=9,LOOKUP(F1,A5:A67,K5:K67),IF(C1=10,LOOKUP(F1,A5:A67,L5:L67), IF(C1=11,LOOKUP(F1,A5:A67,M5:M67), IF(C1=12,LOOKUP(F1,A5:A67,N5:N67),Q1))))))","v":63},{"$f":"IF(C1=13,LOOKUP(F1,A5:A67,O5:O67), IF(C1=14,LOOKUP(F1,A5:A67,P5:P67),IF(C1=15,LOOKUP(F1,A5:A67,Q5:Q67),IF(C1=16,LOOKUP(F1,A5:A67,R5:R67), IF(C1=17,LOOKUP(F1,A5:A67,S5:S67), IF(C1=18,LOOKUP(F1,A5:A67,T5:T67),\"N/A\"))))))","v":63},null,"Eb",{"$f":"IF(L1=1,LOOKUP(I1,A72:A85,C72:C85), IF(L1=2,LOOKUP(I1,A72:A85,D72:D85),IF(L1=3,LOOKUP(I1,A72:A85,E72:E85),IF(L1=4,LOOKUP(I1,A72:A85,F72:F85), IF(L1=5,LOOKUP(I1,A72:A85,G72:G85), IF(L1=6,LOOKUP(I1,A72:A85,H72:H85),IF(L1=7,LOOKUP(I1,A72:A85,I72:I85), U1)))))))","v":60},{"$f":"IF(L1=8,LOOKUP(I1,A72:A85,J72:J85), IF(L1=9,LOOKUP(I1,A72:A85,K72:K85), \"N/A\"))","v":"N/A"},null,"Ea",{"$f":"IF(L1=1,LOOKUP(I1,A72:A85,M72:M85), IF(L1=2,LOOKUP(I1,A72:A85,N72:N85),IF(L1=3,LOOKUP(I1,A72:A85,O72:O85),IF(L1=4,LOOKUP(I1,A72:A85,P72:P85), IF(L1=5,LOOKUP(I1,A72:A85,Q72:Q85), IF(L1=6,LOOKUP(I1,A72:A85,R72:R85),IF(L1=7,LOOKUP(I1,A72:A85,S72:S85), Y1)))))))","v":60},{"$f":"IF(L1=8,LOOKUP(I1,A72:A85,T72:T85), IF(L1=9,LOOKUP(I1,A72:A85,U72:U85), \"N/A\"))","v":"N/A"},null,"Wb",{"$f":"(O1/(T1/100))","v":105},null,"Wa",{"$f":"(O1/(X1/100))","v":105},null,"Crop Notes",{"$f":"(LOOKUP(F1,A5:A67,U5:U67))","v":"ET Based on NRCS state office Aug,2000 (annual) (planting 1/1 and harvesting 12/31)"},null,null,null,null,null,null,null,null,null,null,null,null,"IWM level:",3,null,null,null,null,null,{"$f":"B1","v":"Zone Selection"},{"$f":"C1","v":16},null,{"$f":"E1","v":"Crop"},{"$f":"F1","v":1},null,null,null,null,null,null,null,"Peak Daily ET",{"$f":"IF(BC1=1,LOOKUP(BF1,BA5:BA67,BC5:BC67), IF(BC1=2,LOOKUP(BF1,BA5:BA67,BD5:BD67),IF(BC1=3,LOOKUP(BF1,BA5:BA67,BE5:BE67),IF(BC1=4,LOOKUP(BF1,BA5:BA67,BF5:BF67), IF(BC1=5,LOOKUP(BF1,BA5:BA67,BG5:BG67), IF(BC1=6,LOOKUP(BF1,BA5:BA67,BH5:BH67),BP1))))))","v":0.31},{"$f":"IF(BC1=7,LOOKUP(BF1,BA5:BA67,BI5:BI67), IF(BC1=8,LOOKUP(BF1,BA5:BA67,BJ5:BJ67),IF(BC1=9,LOOKUP(BF1,BA5:BA67,BK5:BK67),IF(BC1=10,LOOKUP(BF1,BA5:BA67,BL5:BL67), IF(BC1=11,LOOKUP(BF1,BA5:BA67,BM5:BM67), IF(BC1=12,LOOKUP(BF1,BA5:BA67,BN5:BN67),BQ1))))))","v":0.31},{"$f":"IF(BC1=13,LOOKUP(BF1,BA5:BA67,BO5:BO67), IF(BC1=14,LOOKUP(BF1,BA5:BA67,BP5:BP67),IF(BC1=15,LOOKUP(BF1,BA5:BA67,BQ5:BQ67),IF(BC1=16,LOOKUP(BF1,BA5:BA67,BR5:BR67), IF(BC1=17,LOOKUP(BF1,BA5:BA67,BS5:BS67), IF(BC1=18,LOOKUP(BF1,BA5:BA67,BT5:BT67),0))))))","v":0.31},{"$f":"IF(BF1=24,BV28,\"\")","v":""}]
[null,null,null,null,null,null,null,null,null,null,null,null,null,null,null,null,null,null,null,null,null,null,null,null,null,null,null,null,null,null,null,null,null,null,null,null,null,null,null,null,null,null,null,null,null,null,"IWM % savings:",{"$f":"IF(AV1=1,0,IF(AV1=2,0.05,IF(AV1=3,0.1,IF(AV1=4,0.15))))","v":0.1}]
["Note:  These values are seasonal estimates based on NRCS California Consumptive Database Aug. 2000",null,1,2,3,4,5,6,7,8,9,10,11,12,13,14,15,16,17,18,null,null,null,null,null,null,null,null,null,null,null,null,null,null,null,null,null,null,null,null,null,null,null,null,null,null,null,null,null,null,null,null,"Note:  These values Peak Daily ET Values are seasonal estimates based on NRCS California Consumptive Database Aug. 2000",null,1,2,3,4,5,6,7,8,9,10,11,12,13,14,15,16,17,18]
[null,null,"Zone 1","Zone 2","Zone 3","Zone 4","Zone 5","Zone 6","Zone 7","Zone 8","Zone 9","Zone 10","Zone 11","Zone 12","Zone 13","Zone 14","Zone 15","Zone 16","Zone 17","Zone 18","Notes",null,null,null,null,null,null,null,null,null,null,null,null,null,null,null,null,null,null,null,null,null,null,null,null,null,null,null,null,null,null,null,null,null,"Zone 1","Zone 2","Zone 3","Zone 4","Zone 5","Zone 6","Zone 7","Zone 8","Zone 9","Zone 10","Zone 11","Zone 12","Zone 13","Zone 14","Zone 15","Zone 16","Zone 17","Zone 18","Notes"]
[1,"Alfalfa",33,39,46,47,44,50,44,50,55,49,53,53,55,57,58,63,67,72,"ET Based on NRCS state office Aug,2000 (annual) (planting 1/1 and harvesting 12/31)",null,null,null,null,null,null,null,null,null,null,null,null,null,null,null,null,null,null,null,null,null,null,null,null,null,null,null,null,null,null,null,1,"Alfalfa",0.15,0.18,0.19,0.19,0.21,0.21,0.25,0.25,0.25,0.27,0.27,0.26,0.3,0.28999999999999998,0.28999999999999998,0.31,0.33,0.33,"ET Based on NRCS state office Aug,2000 (annual) (planting 1/1 and harvesting 12/31)"]
[{"$f":"A5+1","v":2},"Almonds",25,29,33,34,35,36,36,39,41,40,41,42,44,45,46,49,52,54,"ET Based on NRCS state office Aug,2000 (planting 3/1 and harvesting 10/15)",null,null,null,null,null,null,null,null,null,null,null,null,null,null,null,null,null,null,null,null,null,null,null,null,null,null,null,null,null,null,null,{"$f":"BA5+1","v":2},"Almonds",0.16,0.18,0.2,0.2,0.22,0.22,0.26,0.26,0.26,0.28000000000000003,0.28000000000000003,0.27,0.32,0.3,0.3,0.32,0.35,0.34,"ET Based on NRCS state office Aug,2000 (planting 3/1 and harvesting 10/15)"]
[{"$f":"A6+1","v":3},"Apple",24,28,32,32,33,35,34,37,39,38,40,40,42,43,44,47,49,51,"ET Based on NRCS state office Aug,2000 (planting 4/11 and harvesting 11/15)",null,null,null,null,null,null,null,null,null,null,null,null,null,null,null,null,null,null,null,null,null,null,null,null,null,null,null,null,null,null,null,{"$f":"BA6+1","v":3},"Apple",0.15,0.16,0.19,0.2,0.21,0.22,0.25,0.25,0.25,0.27,0.27,0.26,0.3,0.28999999999999998,0.28999999999999998,0.31,0.33,0.32,"ET Based on NRCS state office Aug,2000 (planting 4/11 and harvesting 11/15)"]
[4,"Artichokes",20,24,29,29,26,30,25,29,35,29,32,31,32,34,34,37,40,43,"ET Based on NRCS state office Aug,2000 (planting 7/1 and harvesting 5/1)",null,null,null,null,null,null,null,null,null,null,null,null,null,null,null,null,null,null,null,null,null,null,null,null,null,null,null,null,null,null,null,4,"Artichokes",0.11,0.12,0.14000000000000001,0.15,0.15,0.16,0.17,0.17,0.18,0.18,0.19,0.18,0.2,0.2,0.2,0.22,0.22,0.23,"ET Based on NRCS state office Aug,2000 (planting 7/1 and harvesting 5/1)"]
[5,"Asparagus",30,36,42,42,41,45,41,46,50,46,49,50,51,53,54,58,62,66,"ET Based on NRCS state office Aug,2000 (planting 1/1 and harvesting 12/31)",null,null,null,null,null,null,null,null,null,null,null,null,null,null,null,null,null,null,null,null,null,null,null,null,null,null,null,null,null,null,null,5,"Asparagus",0.15,0.18,0.19,0.19,0.21,0.21,0.25,0.25,0.25,0.27,0.27,0.26,0.3,0.28999999999999998,0.28999999999999998,0.31,0.33,0.33,"ET Based on NRCS state office Aug,2000 (planting 1/1 and harvesting 12/31)"]
[6,"Avocado",23,27,33,33,31,35,31,35,39,35,37,37,38,40,41,44,47,50,"ET Based on NRCS state office Aug,2000 (planting 1/1 and harvesting 12/31)",null,null,null,null,null,null,null,null,null,null,null,null,null,null,null,null,null,null,null,null,null,null,null,null,null,null,null,null,null,null,null,6,"Avocado",0.11,0.12,0.14000000000000001,0.13,0.15,0.15,0.17,0.17,0.17,0.19,0.19,0.18,0.21,0.2,0.2,0.21,0.23,0.23,"ET Based on NRCS state office Aug,2000 (planting 1/1 and harvesting 12/31)"]
[7,"Barley (planting 11/30)",11,13,16,15,13,16,12,15,18,14,15,16,15,17,17,19,20,23,"ET Based on NRCS state office Aug,2000 (planting 11/30 and harvesting 5/31)",null,null,null,null,null,null,null,null,null,null,null,null,null,null,null,null,null,null,null,null,null,null,null,null,null,null,null,null,null,null,null,7,"Barley (planting 11/30)",0.13,0.15,0.18,0.22,0.16,0.18,0.15,0.18,0.2,0.17,0.17,0.2,0.18,0.2,0.22,0.22,0.23,0.26,"ET Based on NRCS state office Aug,2000 (planting 11/30 and harvesting 5/31)"]
[8,"Barley (planting 4/30)",13,15,17,17,19,19,21,21,21,23,23,23,25,25,25,27,28,28,"ET Based on NRCS state office Aug,2000 (planting 4/30 and harvesting 8/31)",null,null,null,null,null,null,null,null,null,null,null,null,null,null,null,null,null,null,null,null,null,null,null,null,null,null,null,null,null,null,null,8,"Barley (planting 4/30)",0.17,0.2,0.22,0.22,0.24,0.24,0.28999999999999998,0.28000000000000003,0.28000000000000003,0.31,0.31,0.3,0.35,0.28999999999999998,0.33,0.35,0.38,0.37,"ET Based on NRCS state office Aug,2000 (planting 4/30 and harvesting 8/31)"]
[9,"Beans (dry)",10,11,12,13,13,14,15,15,16,18,18,19,18,20,20,22,20,20,"ET Based on NRCS state office Aug,2000 (planting 5/1 and harvesting 8/15)",null,null,null,null,null,null,null,null,null,null,null,null,null,null,null,null,null,null,null,null,null,null,null,null,null,null,null,null,null,null,null,9,"Beans (dry)",0.15,0.18,0.19,0.19,0.21,0.21,0.25,0.25,0.25,0.27,0.27,0.26,0.3,0.28999999999999998,0.28999999999999998,0.31,0.33,0.33,"ET Based on NRCS state office Aug,2000 (planting 5/1 and harvesting 8/15)"]
[10,"Beans (Green)",7,8,10,10,9,10,9,11,11,10,10,12,11,12,13,13,14,15,"ET Based on NRCS state office Aug,2000 (planting 3/1 and harvesting 5/31)",null,null,null,null,null,null,null,null,null,null,null,null,null,null,null,null,null,null,null,null,null,null,null,null,null,null,null,null,null,null,null,10,"Beans (Green)",0.13,0.15,0.17,0.17,0.19,0.19,0.18,0.21,0.2,0.2,0.2,0.23,0.22,0.23,0.25,0.26,0.27,0.28999999999999998,"ET Based on NRCS state office Aug,2000 (planting 3/1 and harvesting 5/31)"]
[11,"Beets",9,10,12,11,12,12,11,13,13,13,13,14,14,14,15,16,17,19,"ET Based on NRCS state office Aug,2000 (planting 4/1 and harvesting 6/20)",null,null,null,null,null,null,null,null,null,null,null,null,null,null,null,null,null,null,null,null,null,null,null,null,null,null,null,null,null,null,null,11,"Beets",0.14000000000000001,0.16,0.18,0.17,0.19,0.19,0.19,0.21,0.2,0.22,0.22,0.23,0.24,0.24,0.25,0.26,0.27,0.3,"ET Based on NRCS state office Aug,2000 (planting 4/1 and harvesting 6/20)"]
[12,"Broccoli",10,12,14,13,14,14,14,16,15,16,16,17,17,17,19,20,20,22,"ET Based on NRCS state office Aug,2000 (planting 3/15 and harvesting 7/1)",null,null,null,null,null,null,null,null,null,null,null,null,null,null,null,null,null,null,null,null,null,null,null,null,null,null,null,null,null,null,null,12,"Broccoli",0.15,0.17,0.19,0.19,0.21,0.21,0.21,0.23,0.22,0.24,0.24,0.26,0.26,0.26,0.27,0.28999999999999998,0.3,0.32,"ET Based on NRCS state office Aug,2000 (planting 3/15 and harvesting 7/1)"]
[13,"Carrots",11,14,18,18,14,18,12,16,20,14,17,16,16,18,18,20,22,25,"ET Based on NRCS state office Aug,2000  (planting 9/30 and harvesting 4/30)",null,null,null,null,null,null,null,null,null,null,null,null,null,null,null,null,null,null,null,null,null,null,null,null,null,null,null,null,null,null,null,13,"Carrots",0.11,0.13,0.15,0.15,0.15,0.16,0.14000000000000001,0.16,0.17,0.15,0.15,0.18,0.17,0.18,0.2,0.2,0.21,0.23,"ET Based on NRCS state office Aug,2000  (planting 9/30 and harvesting 4/30)"]
[14,"Celery",6,7,9,10,7,10,6,8,11,7,10,8,9,10,9,11,11,13,"ET Based on NRCS state office Aug,2000 (planting 9/15 and harvesting 1/15)",null,null,null,null,null,null,null,null,null,null,null,null,null,null,null,null,null,null,null,null,null,null,null,null,null,null,null,null,null,null,null,14,"Celery",0.09,0.1,0.11,0.12,0.12,0.13,0.13,0.13,0.15,0.13,0.15,0.14000000000000001,0.15,0.15,0.15,0.17,0.17,0.18,"ET Based on NRCS state office Aug,2000 (planting 9/15 and harvesting 1/15)"]
[15,"Cereal Grains",11,14,17,16,14,17,12,15,19,14,16,16,16,18,18,19,21,25,"ET Based on NRCS state office Aug,2000 (planting 11/1 and harvesting 5/31)",null,null,null,null,null,null,null,null,null,null,null,null,null,null,null,null,null,null,null,null,null,null,null,null,null,null,null,null,null,null,null,15,"Cereal Grains",0.12,0.14000000000000001,0.17,0.16,0.15,0.17,0.14000000000000001,0.17,0.19,0.16,0.16,0.18,0.17,0.18,0.2,0.2,0.22,0.25,"ET Based on NRCS state office Aug,2000 (planting 11/1 and harvesting 5/31)"]
[16,"Citrus",22,26,31,31,29,33,29,33,37,33,36,36,37,38,39,42,45,48,"ET Based on NRCS state office Aug,2000 (planting 1/1 and harvesting 12/31)",null,null,null,null,null,null,null,null,null,null,null,null,null,null,null,null,null,null,null,null,null,null,null,null,null,null,null,null,null,null,null,16,"Citrus",0.1,0.12,0.13,0.13,0.14000000000000001,0.14000000000000001,0.17,0.17,0.17,0.18,0.18,0.17,0.2,0.19,0.19,0.21,0.22,0.22,"ET Based on NRCS state office Aug,2000 (planting 1/1 and harvesting 12/31)"]
[17,"Corn (planting 6/17)",12,13,15,16,16,17,17,18,19,19,20,19,21,21,21,23,24,24,"ET Based on NRCS state office Aug,2000 (silage) (planting 6/17 and harvesting 10/20)",null,null,null,null,null,null,null,null,null,null,null,null,null,null,null,null,null,null,null,null,null,null,null,null,null,null,null,null,null,null,null,17,"Corn (planting 6/17)",0.14000000000000001,0.17,0.19,0.2,0.21,0.22,0.23,0.23,0.24,0.26,0.27,0.26,0.28000000000000003,0.28000000000000003,0.28000000000000003,0.3,0.31,0.31,"ET Based on NRCS state office Aug,2000 (silage) (planting 6/17 and harvesting 10/20)"]
[18,"Corn (planting 3/16)",16,18,20,20,22,22,23,25,24,25,25,27,28,28,29,31,32,33,"ET Based on NRCS state office Aug,2000 (Grain) (planting 3/16 and harvesting 8/15)",null,null,null,null,null,null,null,null,null,null,null,null,null,null,null,null,null,null,null,null,null,null,null,null,null,null,null,null,null,null,null,18,"Corn (planting 3/16)",0.17,0.19,0.21,0.21,0.23,0.23,0.26,0.27,0.26,0.28999999999999998,0.28999999999999998,0.28999999999999998,0.32,0.31,0.31,0.33,0.36,0.36,"ET Based on NRCS state office Aug,2000 (Grain) (planting 3/16 and harvesting 8/15)"]
[19,"Cotton",17,19,21,22,23,24,25,26,27,28,29,28,31,30,31,33,35,35,"ET Based on NRCS state office Aug,2000 (planting 4/16 and harvesting 10/15)",null,null,null,null,null,null,null,null,null,null,null,null,null,null,null,null,null,null,null,null,null,null,null,null,null,null,null,null,null,null,null,19,"Cotton",0.17,0.18,0.2,0.21,0.23,0.23,0.28000000000000003,0.27,0.27,0.3,0.28999999999999998,0.28999999999999998,0.33,0.32,0.32,0.34,0.36,0.34,"ET Based on NRCS state office Aug,2000 (planting 4/16 and harvesting 10/15)"]
[20,"Crucifers",6,7,9,9,8,10,8,9,11,9,10,10,10,11,11,12,12,13,"ET Based on NRCS state office Aug,2000 (planting 8/1 and harvesting 11/15)",null,null,null,null,null,null,null,null,null,null,null,null,null,null,null,null,null,null,null,null,null,null,null,null,null,null,null,null,null,null,null,20,"Crucifers",0.09,0.1,0.12,0.12,0.11,0.13,0.11,0.13,0.15,0.12,0.14000000000000001,0.14000000000000001,0.14000000000000001,0.15,0.15,0.16,0.16,0.18,"ET Based on NRCS state office Aug,2000 (planting 8/1 and harvesting 11/15)"]
[21,"Cucumber",9,11,12,12,12,13,11,13,14,13,13,15,14,15,16,17,17,19,"ET Based on NRCS state office Aug,2000 (planting 3/15 and harvesting 6/15)",null,null,null,null,null,null,null,null,null,null,null,null,null,null,null,null,null,null,null,null,null,null,null,null,null,null,null,null,null,null,null,21,"Cucumber",0.13,0.15,0.17,0.16,0.18,0.18,0.18,0.19,0.19,0.2,0.2,0.22,0.22,0.22,0.23,0.25,0.25,0.28000000000000003,"ET Based on NRCS state office Aug,2000 (planting 3/15 and harvesting 6/15)"]
[22,"Eggplant",23,26,30,31,31,33,32,35,37,36,37,38,40,40,41,44,46,48,"ET Based on NRCS state office Aug,2000 (planting 4/1 and harvesting 11/15)",null,null,null,null,null,null,null,null,null,null,null,null,null,null,null,null,null,null,null,null,null,null,null,null,null,null,null,null,null,null,null,22,"Eggplant",0.13,0.15,0.16,0.17,0.18,0.18,0.22,0.22,0.22,0.23,0.23,0.23,0.26,0.25,0.25,0.27,0.28999999999999998,0.27,"ET Based on NRCS state office Aug,2000 (planting 4/1 and harvesting 11/15)"]
[23,"Evergreen",20,24,28,28,26,30,26,30,33,30,32,32,33,34,35,38,40,43,"ET Based on NRCS state office Aug,2000 (planting 1/1 and harvesting 12/31)",null,null,null,null,null,null,null,null,null,null,null,null,null,null,null,null,null,null,null,null,null,null,null,null,null,null,null,null,null,null,null,23,"Evergreen",0.09,0.11,0.12,0.11,0.13,0.13,0.15,0.15,0.15,0.16,0.16,0.16,0.18,0.17,0.17,0.18,0.2,0.2,"ET Based on NRCS state office Aug,2000 (planting 1/1 and harvesting 12/31)"]
[24,"Grapevines",19,22,24,25,26,27,27,29,30,30,31,32,33,33,34,37,38,40,"ET Based on NRCS state office Aug,2000 (planting 4/1 and harvesting 11/1)",null,null,null,null,null,null,null,null,null,null,null,null,null,null,null,null,null,null,null,null,null,null,null,null,null,null,null,null,null,null,null,24,"Grapevines",0.12,0.14000000000000001,0.16,0.15,0.17,0.17,0.2,0.2,0.2,0.21,0.21,0.21,0.24,0.23,0.23,0.25,0.26,0.26,"ET Based on NRCS state office Aug,2000 (planting 4/1 and harvesting 11/1)","Use 80% peak daily ET due to deficit irrigation"]
[25,"Kiwifruit",23,26,29,30,32,33,34,36,37,37,38,39,41,41,42,45,47,48,"ET Based on NRCS state office Aug,2000 (planting 5/1 and harvesting 10/31)",null,null,null,null,null,null,null,null,null,null,null,null,null,null,null,null,null,null,null,null,null,null,null,null,null,null,null,null,null,null,null,25,"Kiwifruit",0.17,0.19,0.21,0.21,0.23,0.23,0.28000000000000003,0.27,0.27,0.3,0.28999999999999998,0.28999999999999998,0.33,0.32,0.32,0.34,0.36,0.36,"ET Based on NRCS state office Aug,2000 (planting 5/1 and harvesting 10/31)"]
[26,"Lentil",10,11,13,13,14,15,16,16,17,17,18,17,16,19,19,20,21,21,"ET Based on NRCS state office Aug,2000 (planting 6/15 and harvesting 9/30)",null,null,null,null,null,null,null,null,null,null,null,null,null,null,null,null,null,null,null,null,null,null,null,null,null,null,null,null,null,null,null,26,"Lentil",0.15,0.16,0.18,0.19,0.21,0.21,0.24,0.24,0.24,0.26,0.26,0.25,0.28999999999999998,0.28000000000000003,0.28000000000000003,0.3,0.32,0.3,"ET Based on NRCS state office Aug,2000 (planting 6/15 and harvesting 9/30)"]
[27,"Lettuce (Fall Planting)",6,8,10,10,7,10,6,8,11,9,11,10,8,11,11,12,12,14,"ET Based on NRCS state office Aug,2000 (planting 8/31 and harvesting 12/31)",null,null,null,null,null,null,null,null,null,null,null,null,null,null,null,null,null,null,null,null,null,null,null,null,null,null,null,null,null,null,null,27,"Lettuce (Fall Planting)",0.08,0.1,0.12,0.11,0.1,0.11,0.09,0.11,0.13,0.11,0.11,0.12,0.11,0.17,0.17,0.19,0.15,0.17,"ET Based on NRCS state office Aug,2000 (planting 8/31 and harvesting 12/31)"]
[28,"Lettuce (Spring Planting)",13,15,17,17,17,18,17,19,19,19,19,21,21,22,23,24,25,27,"ET Based on NRCS state office Aug,2000 (planting 3/15 and harvesting 7/15)",null,null,null,null,null,null,null,null,null,null,null,null,null,null,null,null,null,null,null,null,null,null,null,null,null,null,null,null,null,null,null,28,"Lettuce (Spring Planting)",0.13,0.15,0.17,0.16,0.18,0.18,0.21,0.21,0.21,0.23,0.23,0.22,0.26,0.24,0.24,0.26,0.28000000000000003,0.28000000000000003,"ET Based on NRCS state office Aug,2000 (planting 3/15 and harvesting 7/15)"]
[29,"Melon (planting 3/16)",15,17,19,19,20,21,22,23,23,24,24,26,26,27,28,30,30,31,"ET Based on NRCS state office Aug,2000 (planting 3/16 and harvesting 7/31)",null,null,null,null,null,null,null,null,null,null,null,null,null,null,null,null,null,null,null,null,null,null,null,null,null,null,null,null,null,null,null,29,"Melon (planting 3/16)",0.14000000000000001,0.17,0.19,0.18,0.2,0.2,0.23,0.23,0.23,0.25,0.25,0.25,0.28000000000000003,0.27,0.27,0.28999999999999998,0.31,0.31,"ET Based on NRCS state office Aug,2000 (planting 3/16 and harvesting 7/31)"]
[30,"Melon (planting 4/1)",24,27,31,31,32,34,34,36,38,37,39,39,41,42,43,46,48,50,"ET Based on NRCS state office Aug,2000 (planting 4/1 and harvesting 1/15)",null,null,null,null,null,null,null,null,null,null,null,null,null,null,null,null,null,null,null,null,null,null,null,null,null,null,null,null,null,null,null,30,"Melon (planting 4/1)",0.14000000000000001,0.15,0.17,0.18,0.2,0.2,0.23,0.23,0.23,0.25,0.25,0.24,0.28000000000000003,0.27,0.27,0.28999999999999998,0.31,0.28999999999999998,"ET Based on NRCS state office Aug,2000 (planting 4/1 and harvesting 1/15)"]
[31,"Millet",10,13,16,16,13,16,11,15,18,14,15,16,15,17,17,19,20,24,"ET Based on NRCS state office Aug,2000 (planting 11/1 and harvesting 5/31)",null,null,null,null,null,null,null,null,null,null,null,null,null,null,null,null,null,null,null,null,null,null,null,null,null,null,null,null,null,null,null,31,"Millet",0.1,0.12,0.15,0.14000000000000001,0.13,0.15,0.12,0.15,0.16,0.14000000000000001,0.14000000000000001,0.16,0.15,0.16,0.17,0.18,0.19,0.22,"ET Based on NRCS state office Aug,2000 (planting 11/1 and harvesting 5/31)"]
[32,"Oats",11,14,17,16,14,17,12,15,19,14,16,16,16,18,18,19,21,25,"ET Based on NRCS state office Aug,2000 (planting 11/1 and harvesting 5/31)",null,null,null,null,null,null,null,null,null,null,null,null,null,null,null,null,null,null,null,null,null,null,null,null,null,null,null,null,null,null,null,32,"Oats",0.12,0.14000000000000001,0.17,0.16,0.15,0.17,0.14000000000000001,0.17,0.19,0.16,0.16,0.18,0.17,0.18,0.2,0.2,0.22,0.25,"ET Based on NRCS state office Aug,2000 (planting 11/1 and harvesting 5/31)"]
[33,"Olives",23,27,33,33,31,35,31,35,39,35,37,37,38,40,41,44,47,50,"ET Based on NRCS state office Aug,2000 (planting 1/1 and harvesting 12/31)",null,null,null,null,null,null,null,null,null,null,null,null,null,null,null,null,null,null,null,null,null,null,null,null,null,null,null,null,null,null,null,33,"Olives",0.11,0.12,0.14000000000000001,0.13,0.15,0.15,0.17,0.17,0.17,0.19,0.19,0.18,0.21,0.2,0.2,0.21,0.23,0.23,"ET Based on NRCS state office Aug,2000 (planting 1/1 and harvesting 12/31)"]
[34,"Onion (dry) (Fall Planting)",15,19,24,23,19,24,17,22,27,20,23,23,23,25,26,28,30,34,"ET Based on NRCS state office Aug,2000 (planting 9/16 and harvesting 5/31)",null,null,null,null,null,null,null,null,null,null,null,null,null,null,null,null,null,null,null,null,null,null,null,null,null,null,null,null,null,null,null,34,"Onion (dry) (Fall Planting)",0.13,0.15,0.17,0.16,0.18,0.18,0.2,0.2,0.19,0.21,0.21,0.22,0.24,0.23,0.23,0.25,0.26,0.28000000000000003,"ET Based on NRCS state office Aug,2000 (planting 9/16 and harvesting 5/31)"]
[35,"Onion (dry) (Spring Planting)",20,23,26,26,27,28,28,31,31,31,32,33,34,35,36,38,40,42,"ET Based on NRCS state office Aug,2000 (planting 3/1 and harvesting 8/31)",null,null,null,null,null,null,null,null,null,null,null,null,null,null,null,null,null,null,null,null,null,null,null,null,null,null,null,null,null,null,null,35,"Onion (dry) (Spring Planting)",0.14000000000000001,0.16,0.18,0.17,0.19,0.19,0.23,0.22,0.22,0.24,0.24,0.24,0.27,0.26,0.26,0.28000000000000003,0.3,0.3,"ET Based on NRCS state office Aug,2000 (planting 3/1 and harvesting 8/31)"]
[36,"Onion (green)",16,18,21,21,21,22,22,24,25,25,25,26,27,27,29,30,32,34,"ET Based on NRCS state office Aug,2000 (planting 3/1 and harvesting 8/31)",null,null,null,null,null,null,null,null,null,null,null,null,null,null,null,null,null,null,null,null,null,null,null,null,null,null,null,null,null,null,null,36,"Onion (green)",0.13,0.15,0.17,0.17,0.19,0.19,0.22,0.22,0.22,0.23,0.24,0.23,0.26,0.25,0.25,0.27,0.28999999999999998,0.28999999999999998,"ET Based on NRCS state office Aug,2000 (planting 3/1 and harvesting 8/31)"]
[37,"Pasture",33,39,46,47,44,50,44,50,55,49,53,53,55,57,58,63,67,72,"ET Based on NRCS state office Aug,2000 (planting 1/1 and harvesting 12/31)",null,null,null,null,null,null,null,null,null,null,null,null,null,null,null,null,null,null,null,null,null,null,null,null,null,null,null,null,null,null,null,37,"Pasture",0.15,0.18,0.19,0.19,0.21,0.21,0.25,0.25,0.25,0.27,0.27,0.24,0.3,0.28999999999999998,0.28999999999999998,0.31,0.28000000000000003,0.33,"ET Based on NRCS state office Aug,2000 (planting 1/1 and harvesting 12/31)"]
[38,"Peas",7,9,10,10,10,10,9,11,11,10,10,12,11,12,13,13,14,16,"ET Based on NRCS state office Aug,2000 (planting 3/1 and harvesting 5/31)",null,null,null,null,null,null,null,null,null,null,null,null,null,null,null,null,null,null,null,null,null,null,null,null,null,null,null,null,null,null,null,38,"Peas",0.14000000000000001,0.16,0.18,0.18,0.19,0.19,0.19,0.21,0.2,0.21,0.21,0.24,0.23,0.24,0.25,0.27,0.28000000000000003,0.3,"ET Based on NRCS state office Aug,2000 (planting 3/1 and harvesting 5/31)"]
[39,"Peppers",20,23,27,26,27,29,28,31,32,32,32,34,35,35,36,39,41,43,"ET Based on NRCS state office Aug,2000 (planting 3/1 and harvesting 8/31)",null,null,null,null,null,null,null,null,null,null,null,null,null,null,null,null,null,null,null,null,null,null,null,null,null,null,null,null,null,null,null,39,"Peppers",0.14000000000000001,0.16,0.18,0.17,0.19,0.19,0.23,0.23,0.23,0.25,0.25,0.24,0.28000000000000003,0.27,0.26,0.28000000000000003,0.3,0.3,"ET Based on NRCS state office Aug,2000 (planting 3/1 and harvesting 8/31)"]
[40,"Pistachios",27,31,35,36,37,38,38,41,43,42,43,44,46,47,48,51,54,56,"ET Estimated based on Westland's data and NRCS Aug,2000 data (added 2\" to NRCS almonds data)",null,null,null,null,null,null,null,null,null,null,null,null,null,null,null,null,null,null,null,null,null,null,null,null,null,null,null,null,null,null,null,40,"Pistachios",0.15,0.17,0.18,0.18,0.2,0.2,0.23,0.24,0.25,0.26,0.26,0.27,0.28000000000000003,0.28999999999999998,0.3,0.31,0.33,0.33,"ET Estimated based on Westland's data and NRCS Aug,2000 data (added 2\" to NRCS almonds data)"]
[41,"Pomegranates",18,22,26,27,28,29,29,32,34,33,34,35,37,38,39,42,45,47,"ET Esimated based on Annexure-11 www.cgg.gov.in/ipmip website and assumed zone 14 was correlated",null,null,null,null,null,null,null,null,null,null,null,null,null,null,null,null,null,null,null,null,null,null,null,null,null,null,null,null,null,null,null,41,"Pomegranates",0.13,0.15,0.17,0.17,0.19,0.19,0.21,0.22,0.23,0.24,0.24,0.25,0.25,0.26,0.26,0.27,0.28999999999999998,0.28999999999999998,"ET Esimated based on Annexure-11 www.cgg.gov.in/ipmip website and assumed zone 14 was correlated"]
[42,"Potato (planting 3/1)",11,13,15,15,14,16,13,16,17,17,17,19,16,19,20,21,21,24,"ET Based on NRCS state office Aug,2000 (planting 3/1 and harvesting 6/30)",null,null,null,null,null,null,null,null,null,null,null,null,null,null,null,null,null,null,null,null,null,null,null,null,null,null,null,null,null,null,null,42,"Potato (planting 3/1)",0.12,0.14000000000000001,0.18,0.15,0.17,0.17,0.17,0.19,0.18,0.25,0.19,0.21,0.21,0.21,0.22,0.23,0.24,0.3,"ET Based on NRCS state office Aug,2000 (planting 3/1 and harvesting 6/30)"]
[43,"Potato (planting 4/30)",17,19,21,22,23,24,25,26,26,27,28,28,30,30,31,33,34,35,"ET Based on NRCS state office Aug,2000 (planting 4/30 and harvesting 9/30)",null,null,null,null,null,null,null,null,null,null,null,null,null,null,null,null,null,null,null,null,null,null,null,null,null,null,null,null,null,null,null,43,"Potato (planting 4/30)",0.13,0.14000000000000001,0.16,0.16,0.18,0.18,0.21,0.21,0.21,0.23,0.23,0.22,0.26,0.25,0.24,0.26,0.28000000000000003,0.27,"ET Based on NRCS state office Aug,2000 (planting 4/30 and harvesting 9/30)"]
[44,"Radishes",2,3,3,3,3,3,3,4,4,3,3,4,4,4,4,4,5,5,"ET Based on NRCS state office Aug,2000 (planting 4/1 and harvesting 5/1)",null,null,null,null,null,null,null,null,null,null,null,null,null,null,null,null,null,null,null,null,null,null,null,null,null,null,null,null,null,null,null,44,"Radishes",0.09,0.11,0.12,0.12,0.12,0.13,0.11,0.13,0.13,0.13,0.13,0.15,0.14000000000000001,0.15,0.16,0.16,0.17,0.19,"ET Based on NRCS state office Aug,2000 (planting 4/1 and harvesting 5/1)"]
[45,"Rice",22,25,29,29,30,31,32,34,34,36,37,37,39,40,40,43,45,47,"ET Based on NRCS state office Aug,2000 (planting 5/1 and harvesting 9/30)",null,null,null,null,null,null,null,null,null,null,null,null,null,null,null,null,null,null,null,null,null,null,null,null,null,null,null,null,null,null,null,45,"Rice",0.17,0.19,0.21,0.21,0.23,0.23,0.28000000000000003,0.27,0.27,0.3,0.28999999999999998,0.28999999999999998,0.33,0.32,0.32,0.34,0.36,0.36,"ET Based on NRCS state office Aug,2000 (planting 5/1 and harvesting 9/30)"]
[46,"Safflower",12,14,16,16,17,18,18,20,19,20,20,21,22,22,23,24,26,27,"ET Based on NRCS state office Aug,2000 (planting 4/1 and harvesting 7/31)",null,null,null,null,null,null,null,null,null,null,null,null,null,null,null,null,null,null,null,null,null,null,null,null,null,null,null,null,null,null,null,46,"Safflower",0.17,0.19,0.21,0.21,0.23,0.23,0.26,0.27,0.26,0.28999999999999998,0.28000000000000003,0.28999999999999998,0.32,0.31,0.31,0.33,0.35,0.36,"ET Based on NRCS state office Aug,2000 (planting 4/1 and harvesting 7/31)"]
[47,"Sorghum (planting 7/1)",10,12,13,14,14,15,15,16,17,16,18,17,18,18,18,20,21,21,"ET Based on NRCS state office Aug,2000 (planting 7/1 and harvesting 10/31)",null,null,null,null,null,null,null,null,null,null,null,null,null,null,null,null,null,null,null,null,null,null,null,null,null,null,null,null,null,null,null,47,"Sorghum (planting 7/1)",0.14000000000000001,0.16,0.18,0.19,0.2,0.21,0.22,0.22,0.23,0.24,0.25,0.24,0.26,0.26,0.26,0.28000000000000003,0.28999999999999998,0.3,"ET Based on NRCS state office Aug,2000 (planting 7/1 and harvesting 10/31)"]
[48,"Sorghum (planting 3/31)",16,19,21,21,23,23,24,26,26,27,27,28,30,30,30,32,34,35,"ET Based on NRCS state office Aug,2000 (planting 3/31 and harvesting 8/31)",null,null,null,null,null,null,null,null,null,null,null,null,null,null,null,null,null,null,null,null,null,null,null,null,null,null,null,null,null,null,null,48,"Sorghum (planting 3/31)",0.17,0.19,0.21,0.21,0.23,0.23,0.28000000000000003,0.27,0.27,0.3,0.28999999999999998,0.28999999999999998,0.33,0.32,0.32,0.34,0.36,0.36,"ET Based on NRCS state office Aug,2000 (planting 3/31 and harvesting 8/31)"]
[49,"Spinach",2,3,4,4,2,4,2,3,5,2,4,3,3,4,3,4,4,5,"ET Based on NRCS state office Aug,2000 (planting 11/15 and harvesting 1/31)",null,null,null,null,null,null,null,null,null,null,null,null,null,null,null,null,null,null,null,null,null,null,null,null,null,null,null,null,null,null,null,49,"Spinach",0.04,0.05,0.06,0.06,0.04,0.06,0.03,0.05,0.08,0.04,0.06,0.05,0.05,0.06,0.06,0.06,7.0000000000000007E-2,0.09,"ET Based on NRCS state office Aug,2000 (planting 11/15 and harvesting 1/31)"]
[50,"Squash",4,5,7,6,5,7,5,6,8,7,9,8,6,9,9,10,8,10,"ET Based on NRCS state office Aug,2000 (planting 8/31 and harvesting 12/31)",null,null,null,null,null,null,null,null,null,null,null,null,null,null,null,null,null,null,null,null,null,null,null,null,null,null,null,null,null,null,null,50,"Squash",0.09,0.1,0.12,0.11,0.11,0.12,0.09,0.13,0.13,0.12,0.12,0.14000000000000001,0.13,0.14000000000000001,0.15,0.15,0.16,0.18,"ET Based on NRCS state office Aug,2000 (planting 8/31 and harvesting 12/31)"]
[51,"Stone fruits",25,29,33,34,35,36,36,39,41,40,41,42,44,45,46,49,52,54,"ET Based on NRCS state office Aug,2000 (planting 3/1 and harvesting 10/15)",null,null,null,null,null,null,null,null,null,null,null,null,null,null,null,null,null,null,null,null,null,null,null,null,null,null,null,null,null,null,null,51,"Stone fruits",0.16,0.18,0.2,0.2,0.22,0.22,0.26,0.26,0.26,0.28000000000000003,0.28000000000000003,0.27,0.32,0.3,0.3,0.32,0.35,0.34,"ET Based on NRCS state office Aug,2000 (planting 3/1 and harvesting 10/15)"]
[52,"Strawberries",11,13,14,15,15,16,17,17,18,18,19,19,20,20,20,22,23,23,"ET Based on NRCS state office Aug,2000 (planting 5/1 and harvesting 9/30)",null,null,null,null,null,null,null,null,null,null,null,null,null,null,null,null,null,null,null,null,null,null,null,null,null,null,null,null,null,null,null,52,"Strawberries",0.11,0.11,0.13,0.13,0.15,0.15,0.17,0.17,0.17,0.19,0.19,0.18,0.21,0.2,0.2,0.21,0.23,0.22,"ET Based on NRCS state office Aug,2000 (planting 5/1 and harvesting 9/30)"]
[53,"Sugarbeets (planting 6/3)",16,20,25,25,20,26,19,23,29,22,25,24,24,27,27,29,32,36,"ET Based on NRCS state office Aug,2000 (planting 6/3 and harvesting 4/30)",null,null,null,null,null,null,null,null,null,null,null,null,null,null,null,null,null,null,null,null,null,null,null,null,null,null,null,null,null,null,null,53,"Sugarbeets (planting 6/16)",0.09,0.1,0.12,0.12,0.12,0.13,0.12,0.13,0.15,0.13,0.14000000000000001,0.14000000000000001,0.14000000000000001,0.2,0.2,0.16,0.17,0.18,"ET Based on NRCS state office Aug,2000 (planting 6/3 and harvesting 4/30)"]
[54,"Sugarbeets (planting 3/16)",20,23,26,26,28,29,30,32,32,33,34,34,36,36,37,40,42,43,"ET Based on NRCS state office Aug,2000 (planting 3/16 and harvesting 9/15)",null,null,null,null,null,null,null,null,null,null,null,null,null,null,null,null,null,null,null,null,null,null,null,null,null,null,null,null,null,null,null,54,"Sugarbeets (planting 3/16)",0.17,0.19,0.21,0.21,0.23,0.23,0.28000000000000003,0.27,0.27,0.3,0.28999999999999998,0.28999999999999998,0.33,0.32,0.32,0.34,0.36,0.36,"ET Based on NRCS state office Aug,2000 (planting 3/16 and harvesting 9/15)"]
[55,"Sunflower",14,15,17,18,19,20,21,22,22,23,24,24,26,25,26,27,29,29,"ET Based on NRCS state office Aug,2000 (planting 5/1 and harvesting 9/10)",null,null,null,null,null,null,null,null,null,null,null,null,null,null,null,null,null,null,null,null,null,null,null,null,null,null,null,null,null,null,null,55,"Sunflower",0.17,0.18,0.21,0.21,0.23,0.23,0.28000000000000003,0.27,0.27,0.3,0.28999999999999998,0.28999999999999998,0.33,0.32,0.32,0.34,0.36,0.35,"ET Based on NRCS state office Aug,2000 (planting 5/1 and harvesting 9/10)"]
[56,"Tomato (planting 1/31)",14,16,19,18,18,19,17,21,21,20,20,22,22,23,24,25,27,30,"ET Based on NRCS state office Aug,2000 (planting 1/31 and harvesting 6/30)",null,null,null,null,null,null,null,null,null,null,null,null,null,null,null,null,null,null,null,null,null,null,null,null,null,null,null,null,null,null,null,56,"Tomato (planting 1/31)",0.16,0.19,0.21,0.21,0.22,0.22,0.22,0.25,0.24,0.25,0.25,0.28000000000000003,0.27,0.28000000000000003,0.28999999999999998,0.31,0.32,0.35,"ET Based on NRCS state office Aug,2000 (planting 1/31 and harvesting 6/30)"]
[57,"Tomato (planting 4/2)",14,16,18,18,20,20,21,22,22,29,29,29,25,31,32,34,29,31,"ET Based on NRCS state office Aug,2000 (planting 4/2 and harvesting 9/8)",null,null,null,null,null,null,null,null,null,null,null,null,null,null,null,null,null,null,null,null,null,null,null,null,null,null,null,null,null,null,null,57,"Tomato (planting 4/2)",0.17,0.2,0.22,0.22,0.24,0.24,0.28999999999999998,0.25,0.28000000000000003,0.31,0.31,0.3,0.35,0.33,0.33,0.35,0.38,0.37,"ET Based on NRCS state office Aug,2000 (planting 4/2 and harvesting 9/8)"]
[58,"Turfgrass",20,24,28,28,26,30,26,30,33,30,32,32,33,34,35,38,40,43,"ET Based on NRCS state office Aug,2000 (Warm Season) (planting 1/1 and harvesting 12/31)",null,null,null,null,null,null,null,null,null,null,null,null,null,null,null,null,null,null,null,null,null,null,null,null,null,null,null,null,null,null,null,58,"Turfgrass",0.15,0.17,0.19,0.19,0.21,0.21,0.24,0.23,0.23,0.25,0.25,0.25,0.28000000000000003,0.27,0.27,0.28999999999999998,0.31,0.32,"ET Based on NRCS state office Aug,2000 (Warm Season) (planting 1/1 and harvesting 12/31)"]
[59,"Walnuts",24,28,32,32,33,35,34,37,39,38,40,40,42,43,44,47,49,51,"ET Based on NRCS state office Aug,2000 (planting 4/1 and harvesting 11/15)",null,null,null,null,null,null,null,null,null,null,null,null,null,null,null,null,null,null,null,null,null,null,null,null,null,null,null,null,null,null,null,59,"Walnuts",0.15,0.16,0.19,0.2,0.21,0.22,0.25,0.25,0.25,0.27,0.27,0.26,0.3,0.28999999999999998,0.28999999999999998,0.31,0.33,0.32,"ET Based on NRCS state office Aug,2000 (planting 4/1 and harvesting 11/15)"]
[60,"Wheat (planting 10/14)",12,14,18,18,14,18,13,16,20,15,17,17,17,19,19,21,23,26,"ET Based on NRCS state office Aug,2000 (planting 10/14 and harvesting 6/2)",null,null,null,null,null,null,null,null,null,null,null,null,null,null,null,null,null,null,null,null,null,null,null,null,null,null,null,null,null,null,null,60,"Wheat (planting 10/14)",0.12,0.14000000000000001,0.17,0.16,0.14000000000000001,0.17,0.13,0.17,0.18,0.15,0.15,0.17,0.16,0.18,0.19,0.2,0.21,0.24,"ET Based on NRCS state office Aug,2000 (planting 10/14 and harvesting 6/2)"]
[61,"Wheat (planting 11/15)",13,18,22,21,19,22,18,22,25,21,22,24,23,25,26,27,30,33,"ET Based on NRCS state office Aug,2000 (planting 11/15 and harvesting 7/4)",null,null,null,null,null,null,null,null,null,null,null,null,null,null,null,null,null,null,null,null,null,null,null,null,null,null,null,null,null,null,null,61,"Wheat (planting 11/15)",0.14000000000000001,0.17,0.19,0.19,0.19,0.2,0.18,0.22,0.21,0.21,0.21,0.24,0.23,0.24,0.26,0.27,0.28000000000000003,0.31,"ET Based on NRCS state office Aug,2000 (planting 11/15 and harvesting 7/4)"]
[62,null,null,null,null,null,null,null,null,null,null,null,null,null,null,null,null,null,null,null,null,null,null,null,null,null,null,null,null,null,null,null,null,null,null,null,null,null,null,null,null,null,null,null,null,null,null,null,null,null,null,null,62]
[63,null,null,null,null,null,null,null,null,null,null,null,null,null,null,null,null,null,null,null,null,null,null,null,null,null,null,null,null,null,null,null,null,null,null,null,null,null,null,null,null,null,null,null,null,null,null,null,null,null,null,null,63]
[]
[null,null,"Before Efficiencies",null,null,null,null,null,null,null,null,null,"After Efficiencies"]
[null,null,1,2,3,4,5,6,7,8,9,null,1,2,3,4,5,6,7,8,9]
[null,null,"s","ls","sl","fsl","l","si","cl","c","organic",null,"s","ls","sl","fsl","l","sil","cl","c","organic"]
[1,"SURFACE IRRIGATION (Under optimal conditions (lined ditch, tailwater recovery, good DU) )",{"$f":"M72","v":60},{"$f":"N72","v":65},70,74,78,78,78,78,65,null,60,65,70,74,78,78,78,78,65]
[{"$f":"A72+1","v":2},"SURFACE IRRIGATION (With an Unlined ditch) ",45,52,59,67,71,73,75,75,52,null,60,65,70,74,78,78,78,78,65]
[{"$f":"A73+1","v":3},"SURFACE IRRIGATION (With a leaky pipeline)",50,55,61,68,72,74,76,76,55,null,60,65,70,74,78,78,78,78,65]
[4,"SURFACE IRRIGATION (With a Low DU)",43,48,54,58,64,64,64,64,48,null,60,65,70,74,78,78,78,78,65]
[5,"SURFACE IRRIGATION (Without a tailwater recovery system)",53,56,58,60,61,61,61,61,56,null,60,65,70,74,78,78,78,78,65]
[6,"SURFACE IRRIGATION (Landleveling (previously leveled)",54,58.5,63,66.5,70,70,70,70,59,null,60,65,70,74,78,78,78,78,65]
[7,"SURFACE IRRIGATION (Unleveled)",48,52,56,59,62,62,62,62,52,null,60,65,70,74,78,78,78,78,65]
[8,"SPRINKLER IRR. (Hand Move/Side Roll) ",73,73,73,73,73,73,73,73,73,null,73,73,73,73,73,73,73,73,73]
[{"$f":"A79+1","v":9},"SPRINKLER IRR. (Solid Set, Undertree)",80,80,80,80,80,80,80,80,80,null,80,80,80,80,80,80,80,80,80]
[{"$f":"A80+1","v":10},"DRIP IRRIGATION ",85,85,85,85,85,85,85,85,85,null,85,85,85,85,85,85,85,85,85]
[{"$f":"A81+1","v":11},"CENTER PIVOTS",80,80,80,80,80,80,80,80,80,null,80,80,80,80,80,80,80,80,80]
[12,null,43,48,54,56,61,61,62,62,48,null,80,80,80,80,80,80,80,80,80]
[13,null,73,73,73,73,73,73,73,73,73,null,80,80,80,80,80,80,80,80,80]
[14]
[]
[]
["No Change in IWM plan",null,"Soil"]
["Increase IWM by 1 Level",null,"Sand"]
["Increase IWM by 2 Levels",null,"Loamy Sand"]
["Increase IWM by 3 Levels",null,"Sandy Loam"]
[null,null,"Fine Sandy Loam"]
[null,null,"Loam"]
[null,null,"Silt"]
[null,null,"Clay Loam"]
[null,null,"Clay "]
[null,null,"Organic"]
[null,null,"used for pull down menu"]
[]
[]
[]
[]
[]
[null,null,"Baseline-select","T-select","R-select",null,null,"ET Zone ",1,{"$f":"I104+1","v":2},{"$f":"J104+1","v":3},4,5,6,7,8,9,10,11,12,13,14,15,16,17,18]
["Selection",null,2,71,42,null,null,{"$f":"1*I105+2*J105+3*K105+4*L105+5*M105+6*N105+7*O105+8*P105+9*Q105+10*R105+11*S105+12*T105+13*U105+14*V105+15*W105+16*X105+17*Y105+18*Z105","v":16},{"$f":"SUM(I121:J126,J127:J138,K126:K131,I132:I133,K134:K136,I136:I140,H138:H142,G141,H142:I143,J143:J144,K144:K145,L145:L146,M146:M149,M151:M153,N150:N157,O156:O159,P158:P160,Q160:Q161,R161:R162,S162:S164,T164:T165,U165:U167,V167:V168,W168:X169,Z168:Z169,Y170:Y177,Z176:Z179,AA178:AA179,I106)","v":0},{"$f":"SUM(Z166:Z167,Z170:Z172,AD180,AE179:AE184,AC184:AD184,AF180:AF184,AG181:AG183,AH181:AH182,AI181,BK216:BN217,BO218,BP219:BQ219)","v":0},{"$f":"SUM(K121:K125,L121:L144,M121:M137,N121:N128,K132:K133,K137:K143,J139:J142,I141,M142:M145,N145:N147,O146:O147,Z173:Z175,AA175:AA177,AB176:AB178,AC177:AC179,AD177:AD179,AE178,AP200:AQ200,AQ201:AR202,AR203:AR208,BB210,BC211:BC212,BD212:BF212,BF213:BI213)","v":0},{"$f":"SUM(N148:P149,O150:P155,P156:Q157,Q152:Q155,R157:R160,Q158:Q159,S159:S161,T161:T163,U162:U164,V165:V166,Y167:Y169,AS208:AZ208,AW209:BB209,BC210,BD211:BE211,BG212:BH212,BJ213:BJ214,BL214:BO214,BM215:BO215,BO216:BO217,BP217:BP218,BR219:BS220,BS221:BU221,BT220,BT222:BV222,BU223:BV224,BW224:BW227,BV225:BV226,BX230:BX231)","v":0},{"$f":"SUM(V162:V164,W163:W167,X165:Y166,X167,Z164)","v":0},{"$f":"SUM(AA170:AC172,AB173:AC173,AB174,AE185:AI186,AG184:AH184,AH183,AF187:AI187,AG188:AJ189,AK189,AH190:AK190,AI191:AL191,AJ192:AL192,AK193:AM193,AL194:AN195,AM196:AO196,AN197:AP197,AO198:AP198,AP199:AR199,AR200:AS200,AS201:AS207,AT203:AT207,AU204:AU207,AV206:AV207,N106)","v":0},{"$f":"SUM(AB123:AB125,AC121:AV126,AD127:AV127,AE128:AV129,AF130:AV131,AG132:AV132,AH133:AV133,AI134:AV134,AJ135:AV135,AK136:AV136,AL137:AV137,AO138:AS138,AU138:AV138)","v":0},{"$f":"SUM(Q149:Q151,R150:R156,S151:S158,T152:T160,U153:U161,V154:V161,W155:Y162,Z156:Z163,X163:Y164,AA158:AA169,AB160:AB169,AC164:AC169,AD165:AD168,Z165,AA173:AA174,AD170:AD176,AC174:AC176,AB175,AE175:AE177,AF177:AF179,AG178:AG180,AH179:AH180,AI180:AJ180)","v":0},{"$f":"SUM(BC209:BG209,BD210:BK210,BF211:BM211,BI212:BW212,BO213:BY213,BW214:BY214,BX215:BY215,BY216,BZ216:BZ231,CA217:CA222,CB218:CB220,BY221:BY226,BX221:BX223,CA226:CA231)","v":0},{"$f":"SUM(U121:AB121,V122:AB122,V123:AA123,W124:AA125,X126:AB127,AC127,Y128:AD129,Z130:AE133,AF132:AF133,AG133,Y134:AH134,Y135:AI135,Y136:AJ136,Y137:Z137,AC137:AG137,AC138:AD138,AJ137:AK137,AI182:AI184,AJ181:AL186,AL187,AM182:AM189,AN183:AN190,AO184:AO192,AP185:AP193,AQ186:AQ195,AR187:AR198,AQ197:AQ198,AS190:AS199,AT192:AT202,R106)","v":0},{"$f":"SUM(AV157,AW158,AV159:AX159,AS160:AZ160,AQ161:BA161,AP162:BB162,AP163:BC163,AO164:BE164,AN165:BF165,AO166:BF166,AP167:BC167,AQ168:BB168,AR169:BB169,AS170:BB171,AT172:BA173,AU174:AZ174,AV175:AX175,AW176)","v":0},{"$f":"SUM(AD146,AB147:AE147,AA148:AF151,AG149:AG151,AA152:AE152,AA153:AC153,AB154:AC156,AD156:AG156,AC157:AH157,AC158:AG158,AE159,AJ187:AK187,AK188,AL188:AL190,AM190:AM191,AL165:AM165,AH166:AN167,AO167,AI168:AP168,AJ169:AQ170,AK171:AQ172,AM173:AQ173,AR170:AR177,AS172:AS179,AP174:AQ175,AQ176,AT174:AT180,AU175:AU180,AV176:AV181,T106)","v":0},{"$f":"SUM(O121:T140,N129:N144,M138:M141,U122:U140,V124:V139,W126:W138,X128:X137,Y130:Y133,O141:T145,P146:V147,U143:U145,V145,Q148:W148,R149:W149,S150:W150,T151:W151,U152:W152,V153:W153,W154:X154,AH137:AI137,AE138:AN138,AT138,AC139:AV142,AD143:AV144,AE145:AV146,AF147:AV147,AG148:AV148,AH149:AV150,AH151,U106)","v":0},{"$f":"SUM(U141:U142,V140:V144,W139:W147,X138:Z153,AA137:AB146,AA147,AC143:AC146,AD145,Y154:AA154,Z155:AA155,AD153:AE155,AF152:AH155,AH156,AI151:AI165,AJ153:AJ165,AK155:AK165,AL157:AL164,AM159:AM164,AA156:AA157,AB157:AB159,AC159:AD163,AH158:AH165,AE160:AG174,AF159:AG159,AD169,AH168:AH178,AF175:AG176,AG177,AI169:AI179,V106)","v":0},{"$f":"SUM(AK180,AL177:AL180,AM174:AM181,AN174:AN182,AO174:AO183,AP176:AP184,AQ177:AQ185,AR178:AR185,AS180:AS185,AT181:AT185,AU181:AU184,AV182,AW196,AX196:AX198,AY195:AY199,AZ194:AZ200,BA192:BB201,BC193:BD202,BE194:BF202,BG196:BG202,BH198:BH200,BH202)","v":0},{"$f":"SUM(AR186,AS186:AS189,AT186:AT191,AU185:AU194,AV183:AV195,AW183:AW195,AX184:AX195,AY185:AY194,AZ186:AZ193,BA189:BA191,AM192,AN191:AN193,AO193:AO195,AP194:AP196,AQ196,BZ214:CA215,CA216:CB216,CB215,CB217:CD217,CC218:CE218,CC219:CF219,CC220:CG220,CG221,CA223:CA225,CB221:CD231,CE224:CF231,CG228:CG231,CH230:CH231,CH217:CI217,X106)","v":1},{"$f":"SUM(BN189,BO188:BO191,BP190:BP208,BO196:BO208,BN197,BN201:BN207,BL202:BM206,BK203:BK206,BJ204:BJ205,BI204,BQ192:BQ208,BR192:BR209,BS195:BS197,BT194:BT197,BU192:BU196,BS200:BS209,BT201:BV209,BW202:BW209,BX202:BY203,BZ203:BZ204,CA202:CC204,CC205,CD204:CD205,CE205,CF204:CF206,CC193:CC195,CD194:CD195,CC185:CC186,CD186:CD189,Y106)","v":0},{"$f":"SUM(BS179,BT179:BT180,BU180:BU183,BV182:BV185,BW183:BW184,BX184:BY187,BY188:BY192,BZ186:BZ192,CA189:CA192,CB192:CB193,CB214:CC214,CC215:CE216,CF216,CE217:CG217,CF218:CH218,CG219:CJ219,CE221:CF223,CG222:CG227,CH220:CL229,CM221:CM230,CI230:CL230,CI231:CJ231,CN222:CO230,CP223:CP230,CQ224:CR230,CS225:CT230,CU226:CU228,CV227:CV228,CW228,Z106)","v":0}]
["Humboldt",1,null,null,null,null,null,null,{"$f":"SUM(AB179:AB180,AC180,AC185:AD187,AE187:AE188,AF188:AF189,AG190,AH191,AI192:AI193,AJ193:AJ195,AK194:AK196,AL196:AL197,AM197,AN198:AN200,AO199:AO202,AP201:AP204,AQ203:AQ207,AQ214:AU215,AZ223:BA223,BK214:BK215,BL215,BV227:BV229,BW228:BW229)","v":0},null,null,null,null,{"$f":"SUM(BK213:BN213,BP214:BV216,BQ217:BY218,BW215:BW216,BX216,BT219:BY219,BU220:BY220,BV221:BW221,BW222:BW223,BX224:BX229,BY227:BY231)","v":0},null,null,null,{"$f":"SUM(AU195:AU203,AV196:AV205,AW197:AW207,AX199:AX207,AY200:AY207,AZ201:AZ207,BA202:BB208,BC203:BC208)","v":0},null,{"$f":"SUM(AW177:AW182,AX178:AX183,AY179:AY184,AZ180:AZ185,BA181:BA188,BB181:BB191,BC183:BC192,BD184:BD192,BE185:BE193,BF187:BF193)","v":0},{"$f":"SUM(AJ151:AV152,AK153:AV154,AL155:AV156,AM157:AU157,AM158:AV158,AN159:AU159,AN160:AR160,AN161:AP161,AN162:AO163,AN164)","v":0},{"$f":"SUM(AJ171:AJ179,AK173:AK179,AL173:AL176,AX176:AX177,AY175:AY178,AZ175:AZ179,BA174:BA180,BB172:BB180,BC168:BC182,BD167:BD183,BE167:BE184,BF167:BF186,BG166:BG195,BH167:BH197,BI168:BJ203,BK170:BK202,BH201,BL171:BL201,BM172:BM201,BN173:BN188,BN190:BN196,BN198:BN200,BO192:BO195,BO174:BO187,BP174:BP189,BQ176:BR191,BS177:BT178,BU179,BS180:BS194,V107)","v":0},null,{"$f":"SUM(CL217:CR217,CI218:CS218,CK219:CT219,CM220:CU220,CN221:CV221,CP222:CV222,CQ223:CV223,CS224:CV224,CU225:CW225,CV226:CW226,CW227:CX227)","v":0},{"$f":"SUM(CE187:CE196,CF191:CF197,CG191:CG207,CH195,CH198:CI207,CJ202:CJ208,CK202:CK204,CL200:CL203,CM196:CM201,CN195:CN199,CO196:CO198,CP197,CK206:CK209,CL207:CL212,CM207:CM211,CN206:CN210,CO205:CO206,CP205,CT201:CU202,CS203:CV203,CQ204:CV205,CW205,CU206:CX207,CV208:CY208,CW209:CZ209,CX210:DA210,CY211:DA211,DA212,Y107)","v":0},{"$f":"SUM(CO215:CR215,CN216:CU216,CS217:CW217,CT218:CW218,CU219:CW219,CV220)","v":0}]
["Mt. Diablo",2,null,null,null,null,null,null,null,null,null,null,null,null,null,null,null,null,null,null,null,{"$f":"SUM(BV180:BW181,BW182:BX182,BX183:BY183,BZ184:CA185,CA186:CB188,CB185,CB189:CB191,CC187:CC192,CD190:CD193,CF187:CH190,CH191:CM194,CI195:CM195,CH196:CL197,CJ198:CL199,CJ200:CK201,CR199:CS202,CP198:CQ202,CO199:CO202,CN201:CN202,CM202,CM203:CR203,CL204:CP204,CK205:CN205,CL206:CM206,BT181:BT193,BU184:BU191,BS198:BS199,BT198:BT200,BU197:BU200,V108)","v":0},null,null,{"$f":"SUM(BY208:CC208,BY209:CE209,CC210:CH210,CD211:CJ211,CF212:CK212,CI215:CJ215,CG216:CM216,CJ217:CK217)","v":0}]
["San Bernadino",3,null,null,null,null,null,null,null,null,null,null,null,null,null,null,null,null,null,null,null,{"$f":"SUM(BV186:BV200,BW185:BW201,BX188:BX201,BY193:CA201,BZ202,CB194:CB201,CC196:CD201,CE197:CE204,CF198:CF203,CD202:CD203,BX204:BY204,BX205:CB205,BX206:CE206,BX207:CF207,CD208:CI208,CF209:CJ209,CI210:CK210,CK211,BX208:BX209,BD203:BH208,BI205:BI208,BH209:BQ209,BJ206:BJ208,BK207:BM208,BN208,BL210:CB210,BN211:CC211,BX212:CE212,BZ213:CL213,V109)","v":0}]
[null,null,null,null,null,null,null,null,null,null,null,null,null,null,null,null,null,null,null,null,null,{"$f":"SUM(,CD214:CL214,CF215:CH215,CK215:CL215,CM212:CM215,CN211:CN215,CO207:CT214,CP206:CT206,CU208:CU214,CV209:CV214,CW210:CW214,CX211:CX214,CY212:CZ212,CS215:CW215,CV216:CW216)","v":0}]
[]
["Drainage",{"$f":"SUM(AQ179,AP180:AR180,AO181:AR181,AP182:AR182,AQ183:AS183,AR184:AT184,AS185:AU185,AT186:AV186,AT187:AV187,AU188:AV188,AV189:AV190,BA182:BB182,BB183:BC183)","v":0},{"$f":"IF(B111=0,\"\",\"Drainage Issue\")","v":""}]
[]
["Count",null,"Humbolt","Mt. Diablo","San Bernadino",null,1,{"$f":"G113+1","v":2},{"$f":"H113+1","v":3},4,5,6,7,8,9,10,11,12,13,14,15,16,17,18,19,20,21,22,23,24,25,26,27,28,29,30,31,32,33,34,35,36,37,38,39,40,41,42,43,44,45,46,47,48,49,50,51,52,53,54,55,56,57,58,59,60,61,62,63,64,65,66,{"$f":"BT113+1","v":67},68,69,70,71,72,73,74,75,76,77,78,79,80,81,82,83,84,85,86,87,88,89,90,91,92,93,94,95,96,97,98,99]
[]
["Humbolt",null,null,null,null,null,"4W","3W","2W","1W","1E","2E","3E","4E","5E","6E","7E","8E","9E","10E"]
["Mt. Diablo",null,null,null,null,null,null,null,null,null,null,"19W","18W","17W","16W","15W","14W","13W","12W","11W","10W","9W","8W","7W","6W","5W","4W","3W","2W","1W","1E","2E","3E","4E","5E","6E","7E","8E","9E","10E","11E","12E","13E","14E","15E","16E","17E","18E","19E","20E","21E","22E","23E","24E","25E","26E","27E","28E","29E","30E","31E","32E","33E","34E","35E","36E","37E","38E","39E","40E","41E","42E","43E","44E","45E","46E","47E"]
["San Bernadino",null,null,null,null,null,null,null,null,null,null,null,null,null,null,null,null,null,null,null,null,null,null,null,null,null,null,null,null,null,null,null,null,null,null,null,null,null,null,null,null,"36W","35W","34W","33W","32W","31W","30W","29W","28W","27W","26W","25W","24W","23W","22W","21W","20W","19W","18W","17W","16W","15W","14W","13W","12W","11W","10W","9W","8W","7W","6W","5W","4W","3W","2W","1W","1E","2E","3E","4E","5E","6E","7E","8E","9E","10E","11E","12E","13E","14E","15E","16E","17E","18E","19E","20E","21E","22E","23E","24E","25E","26E","27E","28E"]
[]
["Lookup",null,null,null,null,null,{"$f":"IF($E$105=G113,1,0)","v":0},{"$f":"IF($E$105=H113,1,0)","v":0},0,0,0,0,0,0,0,0,0,0,0,0,0,0,0,0,0,0,0,0,0,0,0,0,0,0,0,0,0,0,0,0,0,0,0,0,0,0,0,1,0,0,0,0,0,0,0,0,0,0,0,0,0,0,0,0,0,0,0,0,0,0,0,{"$f":"IF($E$105=BT113,1,0)","v":0},0,0,0,0,0,0,0,0,0,0,0,0,0,0,0,0,0,0,0,0,0,0,0,0,0,0,0,0,0,0,0,0,0]
[null,"count"]
[{"$f":"IF($D$105=B121,1,0)","v":0},1,"20N","49N",null,null,{"$f":"MIN(G$119,$A121)","v":0},0,0,0,0,0,0,0,0,0,0,0,0,0,0,0,{"$f":"MIN(W$119,$A121)","v":0},0,0,0,0,0,0,0,0,0,0,0,0,0,0,0,{"$f":"MIN(AM$119,$A121)","v":0},0,0,0,0,0,0,0,0,0,0,0,0,0,0,0,{"$f":"MIN(BC$119,$A121)","v":0},0,0,0,0,0,0,0,0,0,0,0,0,0,0,0,{"$f":"MIN(BS$119,$A121)","v":0},0,0,0,0,0,0,0,0,0,0,0,0,0,0,0,{"$f":"MIN(CI$119,$A121)","v":0},0,0,0,0,0,0,0,0,0,0,0,0,0,0,0,{"$f":"MIN(CY$119,$A121)","v":0},0,0,null,null,null,null,null,null,null,null,null,null,null,null,null,null,null,null,null,"Township selection pulldown",null,null,null,null,null,null,null,"Range Selection pulldown"]
[{"$f":"IF($D$105=B122,1,0)","v":0},{"$f":"B121+1","v":2},"19N","48N",null,null,0,0,0,0,0,0,0,0,0,0,0,0,0,0,0,0,0,0,0,0,0,0,0,0,0,0,0,0,0,0,0,0,0,0,0,0,0,0,0,0,0,0,0,0,0,0,0,0,0,0,0,0,0,0,0,0,0,0,0,0,0,0,0,0,0,0,0,0,0,0,0,0,0,0,0,0,0,0,0,0,0,0,0,0,0,0,0,0,0,0,0,0,0,0,0,0,0,0,0,null,null,null,null,null,null,null,null,null,null,null,null,null,null,null,null,null,{"$f":"IF($C$105=$B$106,C121,IF($C$105=$B$107,D121,IF($C$105=$B$108,E121,\"\")))","v":"49N"},null,null,null,null,null,null,null,{"$f":"IF($C$105=$B$106,G$115,IF($C$105=$B$107,G$116,IF($C$105=$B$108,G$117,\"\")))","v":0}]
[0,{"$f":"B122+1","v":3},"18N","47N",null,null,0,0,0,0,0,0,0,0,0,0,0,0,0,0,0,0,0,0,0,0,0,0,0,0,0,0,0,0,0,0,0,0,0,0,0,0,0,0,0,0,0,0,0,0,0,0,0,0,0,0,0,0,0,0,0,0,0,0,0,0,0,0,0,0,0,0,0,0,0,0,0,0,0,0,0,0,0,0,0,0,0,0,0,0,0,0,0,0,0,0,0,0,0,0,0,0,0,0,0,null,null,null,null,null,null,null,null,null,null,null,null,null,null,null,null,null,"48N",null,null,null,null,null,null,null,{"$f":"IF($C$105=$B$106,H$115,IF($C$105=$B$107,H$116,IF($C$105=$B$108,H$117,\"\")))","v":0}]
[0,4,"17N","46N",null,null,0,0,0,0,0,0,0,0,0,0,0,0,0,0,0,0,0,0,0,0,0,0,0,0,0,0,0,0,0,0,0,0,0,0,0,0,0,0,0,0,0,0,0,0,0,0,0,0,0,0,0,0,0,0,0,0,0,0,0,0,0,0,0,0,0,0,0,0,0,0,0,0,0,0,0,0,0,0,0,0,0,0,0,0,0,0,0,0,0,0,0,0,0,0,0,0,0,0,0,null,null,null,null,null,null,null,null,null,null,null,null,null,null,null,null,null,"47N",null,null,null,null,null,null,null,{"$f":"IF($C$105=$B$106,I$115,IF($C$105=$B$107,I$116,IF($C$105=$B$108,I$117,\"\")))","v":0}]
[0,5,"16N","45N",null,null,0,0,0,0,0,0,0,0,0,0,0,0,0,0,0,0,0,0,0,0,0,0,0,0,0,0,0,0,0,0,0,0,0,0,0,0,0,0,0,0,0,0,0,0,0,0,0,0,0,0,0,0,0,0,0,0,0,0,0,0,0,0,0,0,0,0,0,0,0,0,0,0,0,0,0,0,0,0,0,0,0,0,0,0,0,0,0,0,0,0,0,0,0,0,0,0,0,0,0,null,null,null,null,null,null,null,null,null,null,null,null,null,null,null,null,null,"46N",null,null,null,null,null,null,null,{"$f":"IF($C$105=$B$106,J$115,IF($C$105=$B$107,J$116,IF($C$105=$B$108,J$117,\"\")))","v":0}]
[0,6,"15N","44N",null,null,0,0,0,0,0,0,0,0,0,0,0,0,0,0,0,0,0,0,0,0,0,0,0,0,0,0,0,0,0,0,0,0,0,0,0,0,0,0,0,0,0,0,0,0,0,0,0,0,0,0,0,0,0,0,0,0,0,0,0,0,0,0,0,0,0,0,0,0,0,0,0,0,0,0,0,0,0,0,0,0,0,0,0,0,0,0,0,0,0,0,0,0,0,0,0,0,0,0,0,null,null,null,null,null,null,null,null,null,null,null,null,null,null,null,null,null,"45N",null,null,null,null,null,null,null,{"$f":"IF($C$105=$B$106,K$115,IF($C$105=$B$107,K$116,IF($C$105=$B$108,K$117,\"\")))","v":0}]
[0,7,"14N","43N",null,null,0,0,0,0,0,0,0,0,0,0,0,0,0,0,0,0,0,0,0,0,0,0,0,0,0,0,0,0,0,0,0,0,0,0,0,0,0,0,0,0,0,0,0,0,0,0,0,0,0,0,0,0,0,0,0,0,0,0,0,0,0,0,0,0,0,0,0,0,0,0,0,0,0,0,0,0,0,0,0,0,0,0,0,0,0,0,0,0,0,0,0,0,0,0,0,0,0,0,0,null,null,null,null,null,null,null,null,null,null,null,null,null,null,null,null,null,"44N",null,null,null,null,null,null,null,{"$f":"IF($C$105=$B$106,L$115,IF($C$105=$B$107,L$116,IF($C$105=$B$108,L$117,\"\")))","v":"19W"}]
[0,8,"13N","42N",null,null,0,0,0,0,0,0,0,0,0,0,0,0,0,0,0,0,0,0,0,0,0,0,0,0,0,0,0,0,0,0,0,0,0,0,0,0,0,0,0,0,0,0,0,0,0,0,0,0,0,0,0,0,0,0,0,0,0,0,0,0,0,0,0,0,0,0,0,0,0,0,0,0,0,0,0,0,0,0,0,0,0,0,0,0,0,0,0,0,0,0,0,0,0,0,0,0,0,0,0,null,null,null,null,null,null,null,null,null,null,null,null,null,null,null,null,null,"43N",null,null,null,null,null,null,null,{"$f":"IF($C$105=$B$106,M$115,IF($C$105=$B$107,M$116,IF($C$105=$B$108,M$117,\"\")))","v":"18W"}]
[0,9,"12N","41N",null,null,0,0,0,0,0,0,0,0,0,0,0,0,0,0,0,0,0,0,0,0,0,0,0,0,0,0,0,0,0,0,0,0,0,0,0,0,0,0,0,0,0,0,0,0,0,0,0,0,0,0,0,0,0,0,0,0,0,0,0,0,0,0,0,0,0,0,0,0,0,0,0,0,0,0,0,0,0,0,0,0,0,0,0,0,0,0,0,0,0,0,0,0,0,0,0,0,0,0,0,null,null,null,null,null,null,null,null,null,null,null,null,null,null,null,null,null,"42N",null,null,null,null,null,null,null,{"$f":"IF($C$105=$B$106,N$115,IF($C$105=$B$107,N$116,IF($C$105=$B$108,N$117,\"\")))","v":"17W"}]
[0,10,"11N","40N",null,null,0,0,0,0,0,0,0,0,0,0,0,0,0,0,0,0,0,0,0,0,0,0,0,0,0,0,0,0,0,0,0,0,0,0,0,0,0,0,0,0,0,0,0,0,0,0,0,0,0,0,0,0,0,0,0,0,0,0,0,0,0,0,0,0,0,0,0,0,0,0,0,0,0,0,0,0,0,0,0,0,0,0,0,0,0,0,0,0,0,0,0,0,0,0,0,0,0,0,0,null,null,null,null,null,null,null,null,null,null,null,null,null,null,null,null,null,"41N",null,null,null,null,null,null,null,{"$f":"IF($C$105=$B$106,O$115,IF($C$105=$B$107,O$116,IF($C$105=$B$108,O$117,\"\")))","v":"16W"}]
[0,11,"10N","39N",null,null,0,0,0,0,0,0,0,0,0,0,0,0,0,0,0,0,0,0,0,0,0,0,0,0,0,0,0,0,0,0,0,0,0,0,0,0,0,0,0,0,0,0,0,0,0,0,0,0,0,0,0,0,0,0,0,0,0,0,0,0,0,0,0,0,0,0,0,0,0,0,0,0,0,0,0,0,0,0,0,0,0,0,0,0,0,0,0,0,0,0,0,0,0,0,0,0,0,0,0,null,null,null,null,null,null,null,null,null,null,null,null,null,null,null,null,null,"40N",null,null,null,null,null,null,null,{"$f":"IF($C$105=$B$106,P$115,IF($C$105=$B$107,P$116,IF($C$105=$B$108,P$117,\"\")))","v":"15W"}]
[0,12,"9N","38N",null,null,0,0,0,0,0,0,0,0,0,0,0,0,0,0,0,0,0,0,0,0,0,0,0,0,0,0,0,0,0,0,0,0,0,0,0,0,0,0,0,0,0,0,0,0,0,0,0,0,0,0,0,0,0,0,0,0,0,0,0,0,0,0,0,0,0,0,0,0,0,0,0,0,0,0,0,0,0,0,0,0,0,0,0,0,0,0,0,0,0,0,0,0,0,0,0,0,0,0,0,null,null,null,null,null,null,null,null,null,null,null,null,null,null,null,null,null,"39N",null,null,null,null,null,null,null,{"$f":"IF($C$105=$B$106,Q$115,IF($C$105=$B$107,Q$116,IF($C$105=$B$108,Q$117,\"\")))","v":"14W"}]
[0,13,"8N","37N",null,null,0,0,0,0,0,0,0,0,0,0,0,0,0,0,0,0,0,0,0,0,0,0,0,0,0,0,0,0,0,0,0,0,0,0,0,0,0,0,0,0,0,0,0,0,0,0,0,0,0,0,0,0,0,0,0,0,0,0,0,0,0,0,0,0,0,0,0,0,0,0,0,0,0,0,0,0,0,0,0,0,0,0,0,0,0,0,0,0,0,0,0,0,0,0,0,0,0,0,0,null,null,null,null,null,null,null,null,null,null,null,null,null,null,null,null,null,"38N",null,null,null,null,null,null,null,{"$f":"IF($C$105=$B$106,R$115,IF($C$105=$B$107,R$116,IF($C$105=$B$108,R$117,\"\")))","v":"13W"}]
[0,14,"7N","36N",null,null,0,0,0,0,0,0,0,0,0,0,0,0,0,0,0,0,0,0,0,0,0,0,0,0,0,0,0,0,0,0,0,0,0,0,0,0,0,0,0,0,0,0,0,0,0,0,0,0,0,0,0,0,0,0,0,0,0,0,0,0,0,0,0,0,0,0,0,0,0,0,0,0,0,0,0,0,0,0,0,0,0,0,0,0,0,0,0,0,0,0,0,0,0,0,0,0,0,0,0,null,null,null,null,null,null,null,null,null,null,null,null,null,null,null,null,null,"37N",null,null,null,null,null,null,null,{"$f":"IF($C$105=$B$106,S$115,IF($C$105=$B$107,S$116,IF($C$105=$B$108,S$117,\"\")))","v":"12W"}]
[0,15,"6N","35N",null,null,0,0,0,0,0,0,0,0,0,0,0,0,0,0,0,0,0,0,0,0,0,0,0,0,0,0,0,0,0,0,0,0,0,0,0,0,0,0,0,0,0,0,0,0,0,0,0,0,0,0,0,0,0,0,0,0,0,0,0,0,0,0,0,0,0,0,0,0,0,0,0,0,0,0,0,0,0,0,0,0,0,0,0,0,0,0,0,0,0,0,0,0,0,0,0,0,0,0,0,null,null,null,null,null,null,null,null,null,null,null,null,null,null,null,null,null,"36N",null,null,null,null,null,null,null,{"$f":"IF($C$105=$B$106,T$115,IF($C$105=$B$107,T$116,IF($C$105=$B$108,T$117,\"\")))","v":"11W"}]
[0,16,"5N","34N",null,null,0,0,0,0,0,0,0,0,0,0,0,0,0,0,0,{"$f":"MIN(V$119,$A136)","v":0},0,0,0,0,0,0,0,0,0,0,0,0,0,0,0,{"$f":"MIN(AL$119,$A136)","v":0},0,0,0,0,0,0,0,0,0,0,0,0,0,0,0,{"$f":"MIN(BB$119,$A136)","v":0},0,0,0,0,0,0,0,0,0,0,0,0,0,0,0,{"$f":"MIN(BR$119,$A136)","v":0},0,0,0,0,0,0,0,0,0,0,0,0,0,0,0,{"$f":"MIN(CH$119,$A136)","v":0},0,0,0,0,0,0,0,0,0,0,0,0,0,0,0,{"$f":"MIN(CX$119,$A136)","v":0},0,0,0,null,null,null,null,null,null,null,null,null,null,null,null,null,null,null,null,null,"35N",null,null,null,null,null,null,null,{"$f":"IF($C$105=$B$106,U$115,IF($C$105=$B$107,U$116,IF($C$105=$B$108,U$117,\"\")))","v":"10W"}]
[0,17,"4N","33N",null,null,{"$f":"MIN(G$119,$A137)","v":0},0,0,0,0,0,0,0,0,0,0,0,0,0,0,0,{"$f":"MIN(W$119,$A137)","v":0},0,0,0,0,0,0,0,0,0,0,0,0,0,0,0,{"$f":"MIN(AM$119,$A137)","v":0},0,0,0,0,0,0,0,0,0,0,0,0,0,0,0,{"$f":"MIN(BC$119,$A137)","v":0},0,0,0,0,0,0,0,0,0,0,0,0,0,0,0,{"$f":"MIN(BS$119,$A137)","v":0},0,0,0,0,0,0,0,0,0,0,0,0,0,0,0,{"$f":"MIN(CI$119,$A137)","v":0},0,0,0,0,0,0,0,0,0,0,0,0,0,0,0,{"$f":"MIN(CY$119,$A137)","v":0},0,0,null,null,null,null,null,null,null,null,null,null,null,null,null,null,null,null,null,"34N",null,null,null,null,null,null,null,{"$f":"IF($C$105=$B$106,V$115,IF($C$105=$B$107,V$116,IF($C$105=$B$108,V$117,\"\")))","v":"9W"}]
[0,18,"3N","32N",null,null,0,0,0,0,0,0,0,0,0,0,0,0,0,0,0,0,0,0,0,0,0,0,0,0,0,0,0,0,0,0,0,0,0,0,0,0,0,0,0,0,0,0,0,0,0,0,0,0,0,0,0,0,0,0,0,0,0,0,0,0,0,0,0,0,0,0,0,0,0,0,0,0,0,0,0,0,0,0,0,0,0,0,0,0,0,0,0,0,0,0,0,0,0,0,0,0,0,0,0,null,null,null,null,null,null,null,null,null,null,null,null,null,null,null,null,null,"33N",null,null,null,null,null,null,null,{"$f":"IF($C$105=$B$106,W$115,IF($C$105=$B$107,W$116,IF($C$105=$B$108,W$117,\"\")))","v":"8W"}]
[0,19,"2N","31N",null,null,0,0,0,0,0,0,0,0,0,0,0,0,0,0,0,0,0,0,0,0,0,0,0,0,0,0,0,0,0,0,0,0,0,0,0,0,0,0,0,0,0,0,0,0,0,0,0,0,0,0,0,0,0,0,0,0,0,0,0,0,0,0,0,0,0,0,0,0,0,0,0,0,0,0,0,0,0,0,0,0,0,0,0,0,0,0,0,0,0,0,0,0,0,0,0,0,0,0,0,null,null,null,null,null,null,null,null,null,null,null,null,null,null,null,null,null,"32N",null,null,null,null,null,null,null,{"$f":"IF($C$105=$B$106,X$115,IF($C$105=$B$107,X$116,IF($C$105=$B$108,X$117,\"\")))","v":"7W"}]
[0,20,"1N","30N",null,null,0,0,0,0,0,0,0,0,0,0,0,0,0,0,0,0,0,0,0,0,0,0,0,0,0,0,0,0,0,0,0,0,0,0,0,0,0,0,0,0,0,0,0,0,0,0,0,0,0,0,0,0,0,0,0,0,0,0,0,0,0,0,0,0,0,0,0,0,0,0,0,0,0,0,0,0,0,0,0,0,0,0,0,0,0,0,0,0,0,0,0,0,0,0,0,0,0,0,0,null,null,null,null,null,null,null,null,null,null,null,null,null,null,null,null,null,"31N",null,null,null,null,null,null,null,{"$f":"IF($C$105=$B$106,Y$115,IF($C$105=$B$107,Y$116,IF($C$105=$B$108,Y$117,\"\")))","v":"6W"}]
[0,21,"1S","29N",null,null,0,0,0,0,0,0,0,0,0,0,0,0,0,0,0,0,0,0,0,0,0,0,0,0,0,0,0,0,0,0,0,0,0,0,0,0,0,0,0,0,0,0,0,0,0,0,0,0,0,0,0,0,0,0,0,0,0,0,0,0,0,0,0,0,0,0,0,0,0,0,0,0,0,0,0,0,0,0,0,0,0,0,0,0,0,0,0,0,0,0,0,0,0,0,0,0,0,0,0,null,null,null,null,null,null,null,null,null,null,null,null,null,null,null,null,null,"30N",null,null,null,null,null,null,null,{"$f":"IF($C$105=$B$106,Z$115,IF($C$105=$B$107,Z$116,IF($C$105=$B$108,Z$117,\"\")))","v":"5W"}]
[0,22,"2S","28N",null,null,0,0,0,0,0,0,0,0,0,0,0,0,0,0,0,0,0,0,0,0,0,0,0,0,0,0,0,0,0,0,0,0,0,0,0,0,0,0,0,0,0,0,0,0,0,0,0,0,0,0,0,0,0,0,0,0,0,0,0,0,0,0,0,0,0,0,0,0,0,0,0,0,0,0,0,0,0,0,0,0,0,0,0,0,0,0,0,0,0,0,0,0,0,0,0,0,0,0,0,null,null,null,null,null,null,null,null,null,null,null,null,null,null,null,null,null,"29N",null,null,null,null,null,null,null,{"$f":"IF($C$105=$B$106,AA$115,IF($C$105=$B$107,AA$116,IF($C$105=$B$108,AA$117,\"\")))","v":"4W"}]
[0,23,"3S","27N",null,null,0,0,0,0,0,0,0,0,0,0,0,0,0,0,0,0,0,0,0,0,0,0,0,0,0,0,0,0,0,0,0,0,0,0,0,0,0,0,0,0,0,0,0,0,0,0,0,0,0,0,0,0,0,0,0,0,0,0,0,0,0,0,0,0,0,0,0,0,0,0,0,0,0,0,0,0,0,0,0,0,0,0,0,0,0,0,0,0,0,0,0,0,0,0,0,0,0,0,0,null,null,null,null,null,null,null,null,null,null,null,null,null,null,null,null,null,"28N",null,null,null,null,null,null,null,{"$f":"IF($C$105=$B$106,AB$115,IF($C$105=$B$107,AB$116,IF($C$105=$B$108,AB$117,\"\")))","v":"3W"}]
[0,24,"4S","26N",null,null,0,0,0,0,0,0,0,0,0,0,0,0,0,0,0,0,0,0,0,0,0,0,0,0,0,0,0,0,0,0,0,0,0,0,0,0,0,0,0,0,0,0,0,0,0,0,0,0,0,0,0,0,0,0,0,0,0,0,0,0,0,0,0,0,0,0,0,0,0,0,0,0,0,0,0,0,0,0,0,0,0,0,0,0,0,0,0,0,0,0,0,0,0,0,0,0,0,0,0,null,null,null,null,null,null,null,null,null,null,null,null,null,null,null,null,null,"27N",null,null,null,null,null,null,null,{"$f":"IF($C$105=$B$106,AC$115,IF($C$105=$B$107,AC$116,IF($C$105=$B$108,AC$117,\"\")))","v":"2W"}]
[0,25,"5S","25N",null,null,0,0,0,0,0,0,0,0,0,0,0,0,0,0,0,0,0,0,0,0,0,0,0,0,0,0,0,0,0,0,0,0,0,0,0,0,0,0,0,0,0,0,0,0,0,0,0,0,0,0,0,0,0,0,0,0,0,0,0,0,0,0,0,0,0,0,0,0,0,0,0,0,0,0,0,0,0,0,0,0,0,0,0,0,0,0,0,0,0,0,0,0,0,0,0,0,0,0,0,null,null,null,null,null,null,null,null,null,null,null,null,null,null,null,null,null,"26N",null,null,null,null,null,null,null,{"$f":"IF($C$105=$B$106,AD$115,IF($C$105=$B$107,AD$116,IF($C$105=$B$108,AD$117,\"\")))","v":"1W"}]
[0,26,"6S","24N",null,null,0,0,0,0,0,0,0,0,0,0,0,0,0,0,0,0,0,0,0,0,0,0,0,0,0,0,0,0,0,0,0,0,0,0,0,0,0,0,0,0,0,0,0,0,0,0,0,0,0,0,0,0,0,0,0,0,0,0,0,0,0,0,0,0,0,0,0,0,0,0,0,0,0,0,0,0,0,0,0,0,0,0,0,0,0,0,0,0,0,0,0,0,0,0,0,0,0,0,0,null,null,null,null,null,null,null,null,null,null,null,null,null,null,null,null,null,"25N",null,null,null,null,null,null,null,{"$f":"IF($C$105=$B$106,AE$115,IF($C$105=$B$107,AE$116,IF($C$105=$B$108,AE$117,\"\")))","v":"1E"}]
[0,27,null,"23N",null,null,0,0,0,0,0,0,0,0,0,0,0,0,0,0,0,0,0,0,0,0,0,0,0,0,0,0,0,0,0,0,0,0,0,0,0,0,0,0,0,0,0,0,0,0,0,0,0,0,0,0,0,0,0,0,0,0,0,0,0,0,0,0,0,0,0,0,0,0,0,0,0,0,0,0,0,0,0,0,0,0,0,0,0,0,0,0,0,0,0,0,0,0,0,0,0,0,0,0,0,null,null,null,null,null,null,null,null,null,null,null,null,null,null,null,null,null,"24N",null,null,null,null,null,null,null,{"$f":"IF($C$105=$B$106,AF$115,IF($C$105=$B$107,AF$116,IF($C$105=$B$108,AF$117,\"\")))","v":"2E"}]
[0,28,null,"22N",null,null,0,0,0,0,0,0,0,0,0,0,0,0,0,0,0,0,0,0,0,0,0,0,0,0,0,0,0,0,0,0,0,0,0,0,0,0,0,0,0,0,0,0,0,0,0,0,0,0,0,0,0,0,0,0,0,0,0,0,0,0,0,0,0,0,0,0,0,0,0,0,0,0,0,0,0,0,0,0,0,0,0,0,0,0,0,0,0,0,0,0,0,0,0,0,0,0,0,0,0,null,null,null,null,null,null,null,null,null,null,null,null,null,null,null,null,null,"23N",null,null,null,null,null,null,null,{"$f":"IF($C$105=$B$106,AG$115,IF($C$105=$B$107,AG$116,IF($C$105=$B$108,AG$117,\"\")))","v":"3E"}]
[0,29,null,"21N",null,null,0,0,0,0,0,0,0,0,0,0,0,0,0,0,0,0,0,0,0,0,0,0,0,0,0,0,0,0,0,0,0,0,0,0,0,0,0,0,0,0,0,0,0,0,0,0,0,0,0,0,0,0,0,0,0,0,0,0,0,0,0,0,0,0,0,0,0,0,0,0,0,0,0,0,0,0,0,0,0,0,0,0,0,0,0,0,0,0,0,0,0,0,0,0,0,0,0,0,0,null,null,null,null,null,null,null,null,null,null,null,null,null,null,null,null,null,"22N",null,null,null,null,null,null,null,{"$f":"IF($C$105=$B$106,AH$115,IF($C$105=$B$107,AH$116,IF($C$105=$B$108,AH$117,\"\")))","v":"4E"}]
[0,30,null,"20N",null,null,0,0,0,0,0,0,0,0,0,0,0,0,0,0,0,0,0,0,0,0,0,0,0,0,0,0,0,0,0,0,0,0,0,0,0,0,0,0,0,0,0,0,0,0,0,0,0,0,0,0,0,0,0,0,0,0,0,0,0,0,0,0,0,0,0,0,0,0,0,0,0,0,0,0,0,0,0,0,0,0,0,0,0,0,0,0,0,0,0,0,0,0,0,0,0,0,0,0,0,null,null,null,null,null,null,null,null,null,null,null,null,null,null,null,null,null,"21N",null,null,null,null,null,null,null,{"$f":"IF($C$105=$B$106,AI$115,IF($C$105=$B$107,AI$116,IF($C$105=$B$108,AI$117,\"\")))","v":"5E"}]
[0,31,null,"19N",null,null,0,0,0,0,0,0,0,0,0,0,0,0,0,0,0,0,0,0,0,0,0,0,0,0,0,0,0,0,0,0,0,0,0,0,0,0,0,0,0,0,0,0,0,0,0,0,0,0,0,0,0,0,0,0,0,0,0,0,0,0,0,0,0,0,0,0,0,0,0,0,0,0,0,0,0,0,0,0,0,0,0,0,0,0,0,0,0,0,0,0,0,0,0,0,0,0,0,0,0,null,null,null,null,null,null,null,null,null,null,null,null,null,null,null,null,null,"20N",null,null,null,null,null,null,null,{"$f":"IF($C$105=$B$106,AJ$115,IF($C$105=$B$107,AJ$116,IF($C$105=$B$108,AJ$117,\"\")))","v":"6E"}]
[0,32,null,"18N",null,null,0,0,0,0,0,0,0,0,0,0,0,0,0,0,0,{"$f":"MIN(V$119,$A152)","v":0},0,0,0,0,0,0,0,0,0,0,0,0,0,0,0,{"$f":"MIN(AL$119,$A152)","v":0},0,0,0,0,0,0,0,0,0,0,0,0,0,0,0,{"$f":"MIN(BB$119,$A152)","v":0},0,0,0,0,0,0,0,0,0,0,0,0,0,0,0,{"$f":"MIN(BR$119,$A152)","v":0},0,0,0,0,0,0,0,0,0,0,0,0,0,0,0,{"$f":"MIN(CH$119,$A152)","v":0},0,0,0,0,0,0,0,0,0,0,0,0,0,0,0,{"$f":"MIN(CX$119,$A152)","v":0},0,0,0,null,null,null,null,null,null,null,null,null,null,null,null,null,null,null,null,null,"19N",null,null,null,null,null,null,null,{"$f":"IF($C$105=$B$106,AK$115,IF($C$105=$B$107,AK$116,IF($C$105=$B$108,AK$117,\"\")))","v":"7E"}]
[0,33,null,"17N",null,null,{"$f":"MIN(G$119,$A153)","v":0},0,0,0,0,0,0,0,0,0,0,0,0,0,0,0,0,0,0,0,0,0,0,0,0,0,0,0,0,0,0,0,0,0,0,0,0,0,0,0,0,0,0,0,0,0,0,0,0,0,0,0,0,0,0,0,0,0,0,0,0,0,0,0,0,0,0,0,0,0,0,0,0,0,0,0,0,0,0,0,0,0,0,0,0,0,0,0,0,0,0,0,0,0,0,0,0,0,0,null,null,null,null,null,null,null,null,null,null,null,null,null,null,null,null,null,"18N",null,null,null,null,null,null,null,{"$f":"IF($C$105=$B$106,AL$115,IF($C$105=$B$107,AL$116,IF($C$105=$B$108,AL$117,\"\")))","v":"8E"}]
[0,34,null,"16N",null,null,0,0,0,0,0,0,0,0,0,0,0,0,0,0,0,0,0,0,0,0,0,0,0,0,0,0,0,0,0,0,0,0,0,0,0,0,0,0,0,0,0,0,0,0,0,0,0,0,0,0,0,0,0,0,0,0,0,0,0,0,0,0,0,0,0,0,0,0,0,0,0,0,0,0,0,0,0,0,0,0,0,0,0,0,0,0,0,0,0,0,0,0,0,0,0,0,0,0,0,null,null,null,null,null,null,null,null,null,null,null,null,null,null,null,null,null,"17N",null,null,null,null,null,null,null,{"$f":"IF($C$105=$B$106,AM$115,IF($C$105=$B$107,AM$116,IF($C$105=$B$108,AM$117,\"\")))","v":"9E"}]
[0,35,null,"15N",null,null,0,0,0,0,0,0,0,0,0,0,0,0,0,0,0,0,0,0,0,0,0,0,0,0,0,0,0,0,0,0,0,0,0,0,0,0,0,0,0,0,0,0,0,0,0,0,0,0,0,0,0,0,0,0,0,0,0,0,0,0,0,0,0,0,0,0,0,0,0,0,0,0,0,0,0,0,0,0,0,0,0,0,0,0,0,0,0,0,0,0,0,0,0,0,0,0,0,0,0,null,null,null,null,null,null,null,null,null,null,null,null,null,null,null,null,null,"16N",null,null,null,null,null,null,null,{"$f":"IF($C$105=$B$106,AN$115,IF($C$105=$B$107,AN$116,IF($C$105=$B$108,AN$117,\"\")))","v":"10E"}]
[0,36,null,"14N",null,null,0,0,0,0,0,0,0,0,0,0,0,0,0,0,0,0,0,0,0,0,0,0,0,0,0,0,0,0,0,0,0,0,0,0,0,0,0,0,0,0,0,0,0,0,0,0,0,0,0,0,0,0,0,0,0,0,0,0,0,0,0,0,0,0,0,0,0,0,0,0,0,0,0,0,0,0,0,0,0,0,0,0,0,0,0,0,0,0,0,0,0,0,0,0,0,0,0,0,0,null,null,null,null,null,null,null,null,null,null,null,null,null,null,null,null,null,"15N",null,null,null,null,null,null,null,{"$f":"IF($C$105=$B$106,AO$115,IF($C$105=$B$107,AO$116,IF($C$105=$B$108,AO$117,\"\")))","v":"11E"}]
[0,37,null,"13N",null,null,0,0,0,0,0,0,0,0,0,0,0,0,0,0,0,0,0,0,0,0,0,0,0,0,0,0,0,0,0,0,0,0,0,0,0,0,0,0,0,0,0,0,0,0,0,0,0,0,0,0,0,0,0,0,0,0,0,0,0,0,0,0,0,0,0,0,0,0,0,0,0,0,0,0,0,0,0,0,0,0,0,0,0,0,0,0,0,0,0,0,0,0,0,0,0,0,{"$f":"MIN(CY$119,$A157)","v":0},0,0,null,null,null,null,null,null,null,null,null,null,null,null,null,null,null,null,null,"14N",null,null,null,null,null,null,null,{"$f":"IF($C$105=$B$106,AP$115,IF($C$105=$B$107,AP$116,IF($C$105=$B$108,AP$117,\"\")))","v":"12E"}]
[0,38,null,"12N",null,null,0,0,0,0,0,0,0,0,0,0,0,0,0,0,0,0,0,0,0,0,0,0,0,0,0,0,0,0,0,0,0,0,0,0,0,0,0,0,0,0,0,0,0,0,0,0,0,0,0,0,0,0,0,0,0,0,0,0,0,0,0,0,0,0,0,0,0,0,0,0,0,0,0,0,0,0,0,0,0,0,0,0,0,0,0,0,0,0,0,0,0,0,0,0,0,0,0,0,0,null,null,null,null,null,null,null,null,null,null,null,null,null,null,null,null,null,"13N",null,null,null,null,null,null,null,{"$f":"IF($C$105=$B$106,AQ$115,IF($C$105=$B$107,AQ$116,IF($C$105=$B$108,AQ$117,\"\")))","v":"13E"}]
[0,39,null,"11N",null,null,0,0,0,0,0,0,0,0,0,0,0,0,0,0,0,0,0,0,0,0,0,0,0,0,0,0,0,0,0,0,0,0,0,0,0,0,0,0,0,0,0,0,0,0,0,0,0,0,0,0,0,0,0,0,0,0,0,0,0,0,0,0,0,0,0,0,0,0,0,0,0,0,0,0,0,0,0,0,0,0,0,0,0,0,0,0,0,0,0,0,0,0,0,0,0,0,0,0,0,null,null,null,null,null,null,null,null,null,null,null,null,null,null,null,null,null,"12N",null,null,null,null,null,null,null,{"$f":"IF($C$105=$B$106,AR$115,IF($C$105=$B$107,AR$116,IF($C$105=$B$108,AR$117,\"\")))","v":"14E"}]
[0,40,null,"10N",null,null,0,0,0,0,0,0,0,0,0,0,0,0,0,0,0,0,0,0,0,0,0,0,0,0,0,0,0,0,0,0,0,0,0,0,0,0,0,0,0,0,0,0,0,0,0,0,0,0,0,0,0,0,0,0,0,0,0,0,0,0,0,0,0,0,0,0,0,0,0,0,0,0,0,0,0,0,0,0,0,0,0,0,0,0,0,0,0,0,0,0,0,0,0,0,0,0,0,0,0,null,null,null,null,null,null,null,null,null,null,null,null,null,null,null,null,null,"11N",null,null,null,null,null,null,null,{"$f":"IF($C$105=$B$106,AS$115,IF($C$105=$B$107,AS$116,IF($C$105=$B$108,AS$117,\"\")))","v":"15E"}]
[0,41,null,"9N",null,null,0,0,0,0,0,0,0,0,0,0,0,0,0,0,0,0,0,0,0,0,0,0,0,0,0,0,0,0,0,0,0,0,0,0,0,0,0,0,0,0,0,0,0,0,0,0,0,0,0,0,0,0,0,0,0,0,0,0,0,0,0,0,0,0,0,0,0,0,0,0,0,0,0,0,0,0,0,0,0,0,0,0,0,0,0,0,0,0,0,0,0,0,0,0,0,0,0,0,0,null,null,null,null,null,null,null,null,null,null,null,null,null,null,null,null,null,"10N",null,null,null,null,null,null,null,{"$f":"IF($C$105=$B$106,AT$115,IF($C$105=$B$107,AT$116,IF($C$105=$B$108,AT$117,\"\")))","v":"16E"}]
[0,42,null,"8N",null,null,0,0,0,0,0,0,0,0,0,0,0,0,0,0,0,0,0,0,0,0,0,0,0,0,0,0,0,0,0,0,0,0,0,0,0,0,0,0,0,0,0,0,0,0,0,0,0,0,0,0,0,0,0,0,0,0,0,0,0,0,0,0,0,0,0,0,0,0,0,0,0,0,0,0,0,0,0,0,0,0,0,0,0,0,0,0,0,0,0,0,0,0,0,0,0,0,0,0,0,null,null,null,null,null,null,null,null,null,null,null,null,null,null,null,null,null,"9N",null,null,null,null,null,null,null,{"$f":"IF($C$105=$B$106,AU$115,IF($C$105=$B$107,AU$116,IF($C$105=$B$108,AU$117,\"\")))","v":"17E"}]
[0,43,null,"7N",null,null,0,0,0,0,0,0,0,0,0,0,0,0,0,0,0,0,0,0,0,0,0,0,0,0,0,0,0,0,0,0,0,0,0,0,0,0,0,0,0,0,0,0,0,0,0,0,0,0,0,0,0,0,0,0,0,0,0,0,0,0,0,0,0,0,0,0,0,0,0,0,0,0,0,0,0,0,0,0,0,0,0,0,0,0,0,0,0,0,0,0,0,0,0,0,0,0,0,0,0,null,null,null,null,null,null,null,null,null,null,null,null,null,null,null,null,null,"8N",null,null,null,null,null,null,null,{"$f":"IF($C$105=$B$106,AV$115,IF($C$105=$B$107,AV$116,IF($C$105=$B$108,AV$117,\"\")))","v":"18E"}]
[0,44,null,"6N",null,null,0,0,0,0,0,0,0,0,0,0,0,0,0,0,0,0,0,0,0,0,0,0,0,0,0,0,0,0,0,0,0,0,0,0,0,0,0,0,0,0,0,0,0,0,0,0,0,0,0,0,0,0,0,0,0,0,0,0,0,0,0,0,0,0,0,0,0,0,0,0,0,0,0,0,0,0,0,0,0,0,0,0,0,0,0,0,0,0,0,0,0,0,0,0,0,0,0,0,0,null,null,null,null,null,null,null,null,null,null,null,null,null,null,null,null,null,"7N",null,null,null,null,null,null,null,{"$f":"IF($C$105=$B$106,AW$115,IF($C$105=$B$107,AW$116,IF($C$105=$B$108,AW$117,\"\")))","v":"19E"}]
[0,45,null,"5N",null,null,0,0,0,0,0,0,0,0,0,0,0,0,0,0,0,0,0,0,0,0,0,0,0,0,0,0,0,0,0,0,0,0,0,0,0,0,0,0,0,0,0,0,0,0,0,0,0,0,0,0,0,0,0,0,0,0,0,0,0,0,0,0,0,0,0,0,0,0,0,0,0,0,0,0,0,0,0,0,0,0,0,0,0,0,0,0,0,0,0,0,0,0,0,0,0,0,0,0,0,null,null,null,null,null,null,null,null,null,null,null,null,null,null,null,null,null,"6N",null,null,null,null,null,null,null,{"$f":"IF($C$105=$B$106,AX$115,IF($C$105=$B$107,AX$116,IF($C$105=$B$108,AX$117,\"\")))","v":"20E"}]
[0,46,null,"4N",null,null,0,0,0,0,0,0,0,0,0,0,0,0,0,0,0,0,0,0,0,0,0,0,0,0,0,0,0,0,0,0,0,0,0,0,0,0,0,0,0,0,0,0,0,0,0,0,0,0,0,0,0,0,0,0,0,0,0,0,0,0,0,0,0,0,0,0,0,0,0,0,0,0,0,0,0,0,0,0,0,0,0,0,0,0,0,0,0,0,0,0,0,0,0,0,0,0,0,0,0,null,null,null,null,null,null,null,null,null,null,null,null,null,null,null,null,null,"5N",null,null,null,null,null,null,null,{"$f":"IF($C$105=$B$106,AY$115,IF($C$105=$B$107,AY$116,IF($C$105=$B$108,AY$117,\"\")))","v":"21E"}]
[0,47,null,"3N",null,null,0,0,0,0,0,0,0,0,0,0,0,0,0,0,0,0,0,0,0,0,0,0,0,0,0,0,0,0,0,0,0,0,0,0,0,0,0,0,0,0,0,0,0,0,0,0,0,0,0,0,0,0,0,0,0,0,0,0,0,0,0,0,0,0,0,0,0,0,0,0,0,0,0,0,0,0,0,0,0,0,0,0,0,0,0,0,0,0,0,0,0,0,0,0,0,0,0,0,0,null,null,null,null,null,null,null,null,null,null,null,null,null,null,null,null,null,"4N",null,null,null,null,null,null,null,{"$f":"IF($C$105=$B$106,AZ$115,IF($C$105=$B$107,AZ$116,IF($C$105=$B$108,AZ$117,\"\")))","v":"22E"}]
[0,48,null,"2N",null,null,0,0,0,0,0,0,0,0,0,0,0,0,0,0,0,0,{"$f":"MIN(W$119,$A168)","v":0},0,0,0,0,0,0,0,0,0,0,0,0,0,0,0,0,0,0,0,0,0,0,0,0,0,0,0,0,0,0,0,0,0,0,0,0,0,0,0,0,0,0,0,0,0,0,0,0,0,0,0,0,0,0,0,0,0,0,0,0,0,0,0,{"$f":"MIN(CI$119,$A168)","v":0},0,0,0,0,0,0,0,0,0,0,0,0,0,0,0,{"$f":"MIN(CY$119,$A168)","v":0},0,0,null,null,null,null,null,null,null,null,null,null,null,null,null,null,null,null,null,"3N",null,null,null,null,null,null,null,{"$f":"IF($C$105=$B$106,BA$115,IF($C$105=$B$107,BA$116,IF($C$105=$B$108,BA$117,\"\")))","v":"23E"}]
[0,49,null,"1N",null,null,{"$f":"MIN(G$119,$A169)","v":0},0,0,0,0,0,0,0,0,0,0,0,0,0,0,0,0,0,0,0,0,0,0,0,0,0,0,0,0,0,0,0,0,0,0,0,0,0,0,0,0,0,0,0,0,0,0,0,0,0,0,0,0,0,0,0,0,0,0,0,0,0,0,0,0,0,0,0,0,0,0,0,0,0,0,0,0,0,0,0,0,0,0,0,0,0,0,0,0,0,0,0,0,0,0,0,0,0,0,null,null,null,null,null,null,null,null,null,null,null,null,null,null,null,null,null,"2N",null,null,null,null,null,null,null,{"$f":"IF($C$105=$B$106,BB$115,IF($C$105=$B$107,BB$116,IF($C$105=$B$108,BB$117,\"\")))","v":"24E"}]
[0,50,null,"1S",null,null,0,0,0,0,0,0,0,0,0,0,0,0,0,0,0,0,0,0,0,0,0,0,0,0,0,0,0,0,0,0,0,0,0,0,0,0,0,0,0,0,0,0,0,0,0,0,0,0,0,0,0,0,0,0,0,0,0,0,0,0,0,0,0,0,0,0,0,0,0,0,0,0,0,0,0,0,0,0,0,0,0,0,0,0,0,0,0,0,0,0,0,0,0,0,0,0,0,0,0,null,null,null,null,null,null,null,null,null,null,null,null,null,null,null,null,null,"1N",null,null,null,null,null,null,null,{"$f":"IF($C$105=$B$106,BC$115,IF($C$105=$B$107,BC$116,IF($C$105=$B$108,BC$117,\"\")))","v":"25E"}]
[0,51,null,"2S",null,null,0,0,0,0,0,0,0,0,0,0,0,0,0,0,0,0,0,0,0,0,0,0,0,0,0,0,0,0,0,0,0,0,0,0,0,0,0,0,0,0,0,0,0,0,0,0,0,0,0,0,0,0,0,0,0,0,0,0,0,0,0,0,0,0,0,0,0,0,0,0,0,0,0,0,0,0,0,0,0,{"$f":"MIN(CH$119,$A171)","v":0},0,0,0,0,0,0,0,0,0,0,0,0,0,0,0,0,0,0,0,null,null,null,null,null,null,null,null,null,null,null,null,null,null,null,null,null,"1S",null,null,null,null,null,null,null,{"$f":"IF($C$105=$B$106,BD$115,IF($C$105=$B$107,BD$116,IF($C$105=$B$108,BD$117,\"\")))","v":"26E"}]
[0,52,null,"3S",null,null,0,0,0,0,0,0,0,0,0,0,0,0,0,0,0,0,{"$f":"MIN(W$119,$A172)","v":0},0,0,0,0,0,0,0,0,0,0,0,0,0,0,0,{"$f":"MIN(AM$119,$A172)","v":0},0,0,0,0,0,0,0,0,0,0,0,0,0,0,0,{"$f":"MIN(BC$119,$A172)","v":0},0,0,0,0,0,0,0,0,0,0,0,0,0,0,0,{"$f":"MIN(BS$119,$A172)","v":0},0,0,0,0,0,0,0,0,0,0,0,0,0,0,0,0,0,0,0,0,0,0,0,0,0,0,0,0,0,0,0,0,0,0,null,null,null,null,null,null,null,null,null,null,null,null,null,null,null,null,null,"2S",null,null,null,null,null,null,null,{"$f":"IF($C$105=$B$106,BE$115,IF($C$105=$B$107,BE$116,IF($C$105=$B$108,BE$117,\"\")))","v":"27E"}]
[0,53,null,"4S",null,null,0,0,0,0,0,0,0,0,0,0,0,0,0,0,0,0,0,0,0,0,0,0,0,0,0,0,0,0,0,0,0,0,0,0,0,0,0,0,0,0,0,0,0,0,0,0,0,0,0,0,0,0,0,0,0,0,0,0,0,0,0,0,0,0,0,0,0,0,0,0,0,0,0,0,0,0,0,0,0,0,0,0,0,0,0,0,0,0,0,0,0,0,0,0,0,0,0,0,0,null,null,null,null,null,null,null,null,null,null,null,null,null,null,null,null,null,"3S",null,null,null,null,null,null,null,{"$f":"IF($C$105=$B$106,BF$115,IF($C$105=$B$107,BF$116,IF($C$105=$B$108,BF$117,\"\")))","v":"28E"}]
[0,54,null,"5S",null,null,0,0,0,0,0,0,0,0,0,0,0,0,0,0,0,0,0,0,0,0,0,0,0,0,0,0,0,0,0,0,0,0,0,0,0,0,0,0,0,0,0,0,0,0,0,0,0,0,0,0,0,0,0,0,0,0,0,0,0,0,0,0,0,0,0,0,0,0,0,0,0,0,0,0,0,0,0,0,0,0,0,0,0,0,0,0,0,0,0,0,0,0,0,0,0,0,0,0,0,null,null,null,null,null,null,null,null,null,null,null,null,null,null,null,null,null,"4S",null,null,null,null,null,null,null,{"$f":"IF($C$105=$B$106,BG$115,IF($C$105=$B$107,BG$116,IF($C$105=$B$108,BG$117,\"\")))","v":"29E"}]
[0,55,null,"6S",null,null,0,0,0,0,0,0,0,0,0,0,0,0,0,0,0,0,0,0,0,0,0,0,0,0,0,0,0,0,0,0,0,0,0,0,0,0,0,0,0,0,0,0,0,0,0,0,0,0,0,0,0,0,0,0,0,0,0,0,0,0,0,0,0,0,0,0,0,0,0,0,0,0,0,0,0,0,0,0,0,0,0,0,0,0,0,0,0,0,0,0,0,0,0,0,0,0,0,0,0,null,null,null,null,null,null,null,null,null,null,null,null,null,null,null,null,null,"5S",null,null,null,null,null,null,null,{"$f":"IF($C$105=$B$106,BH$115,IF($C$105=$B$107,BH$116,IF($C$105=$B$108,BH$117,\"\")))","v":"30E"}]
[0,56,null,"7S",null,null,0,0,0,0,0,0,0,0,0,0,0,0,0,0,0,0,0,0,0,0,0,0,0,0,0,0,0,0,0,0,0,0,0,0,0,0,0,0,0,0,0,0,0,0,0,0,0,0,0,0,0,0,0,0,0,0,0,0,0,0,0,0,0,0,0,0,0,0,0,0,0,0,0,0,0,0,0,0,0,0,0,0,0,0,0,0,0,0,0,0,0,0,0,0,0,0,0,0,0,null,null,null,null,null,null,null,null,null,null,null,null,null,null,null,null,null,"6S",null,null,null,null,null,null,null,{"$f":"IF($C$105=$B$106,BI$115,IF($C$105=$B$107,BI$116,IF($C$105=$B$108,BI$117,\"\")))","v":"31E"}]
[0,57,null,"8S",null,null,0,0,0,0,0,0,0,0,0,0,0,0,0,0,0,0,0,0,0,0,0,0,0,0,0,0,0,0,0,0,0,0,0,0,0,0,0,0,0,0,0,0,0,0,0,0,0,0,0,0,0,0,0,0,0,0,0,0,0,0,0,0,0,0,0,0,0,0,0,0,0,0,0,0,0,0,0,0,0,0,0,0,0,0,0,0,0,0,0,0,0,0,0,0,0,0,0,0,0,null,null,null,null,null,null,null,null,null,null,null,null,null,null,null,null,null,"7S",null,null,null,null,null,null,null,{"$f":"IF($C$105=$B$106,BJ$115,IF($C$105=$B$107,BJ$116,IF($C$105=$B$108,BJ$117,\"\")))","v":"32E"}]
[0,58,null,"9S",null,null,0,0,0,0,0,0,0,0,0,0,0,0,0,0,0,0,0,0,0,0,0,0,0,0,0,0,0,0,0,0,0,0,0,0,0,0,0,0,0,0,0,0,0,0,0,0,0,0,0,0,0,0,0,0,0,0,0,0,0,0,0,0,0,0,0,0,0,0,0,0,0,0,0,0,0,0,0,0,0,0,0,0,0,0,0,0,0,0,0,0,0,0,0,0,0,0,0,0,0,null,null,null,null,null,null,null,null,null,null,null,null,null,null,null,null,null,"8S",null,null,null,null,null,null,null,{"$f":"IF($C$105=$B$106,BK$115,IF($C$105=$B$107,BK$116,IF($C$105=$B$108,BK$117,\"\")))","v":"33E"}]
[0,59,null,"10S",null,null,0,0,0,0,0,0,0,0,0,0,0,0,0,0,0,0,0,0,0,0,0,0,0,0,0,0,0,0,0,0,0,0,0,0,0,0,0,0,0,0,0,0,0,0,0,0,0,0,0,0,0,0,0,0,0,0,0,0,0,0,0,0,0,0,0,0,0,0,0,0,0,0,0,0,0,0,0,0,0,0,0,0,0,0,0,0,0,0,0,0,0,0,0,0,0,0,0,0,0,null,null,null,null,null,null,null,null,null,null,null,null,null,null,null,null,null,"9S",null,null,null,null,null,null,null,{"$f":"IF($C$105=$B$106,BL$115,IF($C$105=$B$107,BL$116,IF($C$105=$B$108,BL$117,\"\")))","v":"34E"}]
[0,60,null,"11S",null,null,0,0,0,0,0,0,0,0,0,0,0,0,0,0,0,0,0,0,0,0,0,0,0,0,0,0,0,0,0,0,0,0,0,0,0,0,0,0,0,0,0,0,0,0,0,0,0,0,0,0,0,0,0,0,0,0,0,0,0,0,0,0,0,0,0,0,0,0,0,0,0,0,0,0,0,0,0,0,0,0,0,0,0,0,0,0,0,0,0,0,0,0,0,0,0,0,0,0,0,null,null,null,null,null,null,null,null,null,null,null,null,null,null,null,null,null,"10S",null,null,null,null,null,null,null,{"$f":"IF($C$105=$B$106,BM$115,IF($C$105=$B$107,BM$116,IF($C$105=$B$108,BM$117,\"\")))","v":"35E"}]
[0,61,null,"12S",null,null,0,0,0,0,0,0,0,0,0,0,0,0,0,0,0,0,0,0,0,0,0,0,0,0,0,0,0,0,0,0,0,0,0,0,0,0,0,0,0,0,0,0,0,0,0,0,0,0,0,0,0,0,0,0,0,0,0,0,0,0,0,0,0,0,0,0,0,0,0,0,0,0,0,0,0,0,0,0,0,0,0,0,0,0,0,0,0,0,0,0,0,0,0,0,0,0,0,0,0,null,null,null,null,null,null,null,null,null,null,null,null,null,null,null,null,null,"11S",null,null,null,null,null,null,null,{"$f":"IF($C$105=$B$106,BN$115,IF($C$105=$B$107,BN$116,IF($C$105=$B$108,BN$117,\"\")))","v":"36E"}]
[0,62,null,"13S","31N",null,0,0,0,0,0,0,0,0,0,0,0,0,0,0,0,0,0,0,0,0,0,0,0,0,0,0,0,0,0,0,0,0,0,0,0,0,0,0,0,0,0,0,0,0,0,0,0,0,0,0,0,0,0,0,0,0,0,0,0,0,0,0,0,0,0,0,0,0,0,0,0,0,0,0,0,0,0,0,0,0,0,0,0,0,0,0,0,0,0,0,0,0,0,0,0,0,0,0,0,null,null,null,null,null,null,null,null,null,null,null,null,null,null,null,null,null,"12S",null,null,null,null,null,null,null,{"$f":"IF($C$105=$B$106,BO$115,IF($C$105=$B$107,BO$116,IF($C$105=$B$108,BO$117,\"\")))","v":"37E"}]
[0,63,null,"14S","30N",null,0,0,0,0,0,0,0,0,0,0,0,0,0,0,0,0,0,0,0,0,0,0,0,0,0,0,0,0,0,0,0,0,0,0,0,0,0,0,0,0,0,0,0,0,0,0,0,0,0,0,0,0,0,0,0,0,0,0,0,0,0,0,0,0,0,0,0,0,0,0,0,0,0,0,0,0,0,0,0,0,0,0,0,0,0,0,0,0,0,0,0,0,0,0,0,0,0,0,0,null,null,null,null,null,null,null,null,null,null,null,null,null,null,null,null,null,"13S",null,null,null,null,null,null,null,{"$f":"IF($C$105=$B$106,BP$115,IF($C$105=$B$107,BP$116,IF($C$105=$B$108,BP$117,\"\")))","v":"38E"}]
[0,64,null,"15S","29N",null,0,0,0,0,0,0,0,0,0,0,0,0,0,0,0,{"$f":"MIN(V$119,$A184)","v":0},0,0,0,0,0,0,0,0,0,0,0,0,0,0,0,0,0,0,0,0,0,0,0,0,0,0,0,0,0,0,0,0,0,0,0,0,0,0,0,0,0,0,0,0,0,0,0,0,0,0,0,0,0,0,0,0,0,0,0,0,0,0,0,0,0,0,0,0,0,0,0,0,0,0,0,0,0,0,0,0,0,0,0,null,null,null,null,null,null,null,null,null,null,null,null,null,null,null,null,null,"14S",null,null,null,null,null,null,null,{"$f":"IF($C$105=$B$106,BQ$115,IF($C$105=$B$107,BQ$116,IF($C$105=$B$108,BQ$117,\"\")))","v":"39E"}]
[0,65,null,"16S","28N",null,{"$f":"MIN(G$119,$A185)","v":0},0,0,0,0,0,0,0,0,0,0,0,0,0,0,0,0,0,0,0,0,0,0,0,0,0,0,0,0,0,0,0,0,0,0,0,0,0,0,0,0,0,0,0,0,0,0,0,0,0,0,0,0,0,0,0,0,0,0,0,0,0,0,0,0,0,0,0,0,0,0,0,0,0,0,0,0,0,0,0,0,0,0,0,0,0,0,0,0,0,0,0,0,0,0,0,0,0,0,null,null,null,null,null,null,null,null,null,null,null,null,null,null,null,null,null,"15S",null,null,null,null,null,null,null,{"$f":"IF($C$105=$B$106,BR$115,IF($C$105=$B$107,BR$116,IF($C$105=$B$108,BR$117,\"\")))","v":"40E"}]
[{"$f":"IF($D$105=B186,1,0)","v":0},66,null,"17S","27N",null,0,0,0,0,0,0,0,0,0,0,0,0,0,0,0,0,0,0,0,0,0,0,0,0,0,0,0,0,0,0,0,0,0,0,0,0,0,0,0,0,0,0,0,0,0,0,0,0,0,0,0,0,0,0,0,0,0,0,0,0,0,0,0,0,0,0,0,0,0,0,0,0,0,0,0,0,0,0,0,0,0,0,0,0,0,0,0,0,0,0,0,0,0,0,0,0,0,0,0,null,null,null,null,null,null,null,null,null,null,null,null,null,null,null,null,null,{"$f":"IF($C$105=$B$106,C185,IF($C$105=$B$107,D185,IF($C$105=$B$108,E185,\"\")))","v":"16S"},null,null,null,null,null,null,null,{"$f":"IF($C$105=$B$106,BS$115,IF($C$105=$B$107,BS$116,IF($C$105=$B$108,BS$117,\"\")))","v":"41E"}]
[0,{"$f":"B186+1","v":67},null,"18S","26N",null,0,0,0,0,0,0,0,0,0,0,0,0,0,0,0,0,0,0,0,0,0,0,0,0,0,0,0,0,0,0,0,0,0,0,0,0,0,0,0,0,0,0,0,0,0,0,0,{"$f":"MIN(BB$119,$A187)","v":0},0,0,0,0,0,0,0,0,0,0,0,0,0,0,0,{"$f":"MIN(BR$119,$A187)","v":0},0,0,0,0,0,0,0,0,0,0,0,0,0,0,0,0,{"$f":"MIN(CI$119,$A187)","v":0},0,0,0,0,0,0,0,0,0,0,0,0,0,0,0,0,0,0,null,null,null,null,null,null,null,null,null,null,null,null,null,null,null,null,null,"17S",null,null,null,null,null,null,null,{"$f":"IF($C$105=$B$106,BT$115,IF($C$105=$B$107,BT$116,IF($C$105=$B$108,BT$117,\"\")))","v":"42E"}]
[0,68,null,"19S","25N",null,0,0,0,0,0,0,0,0,0,0,0,0,0,0,0,0,0,0,0,0,0,0,0,0,0,0,0,0,0,0,0,{"$f":"MIN(AL$119,$A188)","v":0},0,0,0,0,0,0,0,0,0,0,0,0,0,0,0,0,0,0,0,0,0,0,0,0,0,0,0,0,0,0,0,0,0,0,0,0,0,0,0,0,0,0,0,0,0,0,0,{"$f":"MIN(CH$119,$A188)","v":0},0,0,0,0,0,0,0,0,0,0,0,0,0,0,0,0,{"$f":"MIN(CY$119,$A188)","v":0},0,0,null,null,null,null,null,null,null,null,null,null,null,null,null,null,null,null,null,"18S",null,null,null,null,null,null,null,{"$f":"IF($C$105=$B$106,BU$115,IF($C$105=$B$107,BU$116,IF($C$105=$B$108,BU$117,\"\")))","v":"43E"}]
[0,69,null,"20S","24N",null,0,0,0,0,0,0,0,0,0,0,0,0,0,0,0,0,0,0,0,0,0,0,0,0,0,0,0,0,0,0,0,0,0,0,0,0,0,0,0,0,0,0,0,0,0,0,0,0,0,0,0,0,0,0,0,0,0,0,0,0,0,0,0,0,0,0,0,0,0,0,0,0,0,0,0,0,0,0,0,0,0,0,0,0,0,0,0,0,0,0,0,0,0,0,0,0,0,0,0,null,null,null,null,null,null,null,null,null,null,null,null,null,null,null,null,null,"19S",null,null,null,null,null,null,null,{"$f":"IF($C$105=$B$106,BV$115,IF($C$105=$B$107,BV$116,IF($C$105=$B$108,BV$117,\"\")))","v":"44E"}]
[0,70,null,"21S","23N",null,0,0,0,0,0,0,0,0,0,0,0,0,0,0,0,0,0,0,0,0,0,0,0,0,0,0,0,0,0,0,0,0,0,0,0,0,0,0,0,0,0,0,0,0,0,0,0,0,0,0,0,0,0,0,0,0,0,0,0,0,0,0,0,0,0,0,0,0,0,0,0,0,0,0,0,0,0,0,0,0,0,0,0,0,0,0,0,0,0,0,0,0,0,0,0,0,0,0,0,null,null,null,null,null,null,null,null,null,null,null,null,null,null,null,null,null,"20S",null,null,null,null,null,null,null,{"$f":"IF($C$105=$B$106,BW$115,IF($C$105=$B$107,BW$116,IF($C$105=$B$108,BW$117,\"\")))","v":"45E"}]
[1,71,null,"22S","22N",null,0,0,0,0,0,0,0,0,0,0,0,0,0,0,0,0,0,0,0,0,0,0,0,0,0,0,0,0,0,0,0,0,0,0,0,0,0,0,0,0,0,1,0,0,0,0,0,0,0,0,0,0,0,0,0,0,0,0,0,0,0,0,0,0,0,0,0,0,0,0,0,0,0,0,0,0,0,0,0,0,0,0,0,0,0,0,0,0,0,0,0,0,0,0,0,0,0,0,0,null,null,null,null,null,null,null,null,null,null,null,null,null,null,null,null,null,"21S",null,null,null,null,null,null,null,{"$f":"IF($C$105=$B$106,BX$115,IF($C$105=$B$107,BX$116,IF($C$105=$B$108,BX$117,\"\")))","v":"46E"}]
[0,72,null,"23S","21N",null,0,0,0,0,0,0,0,0,0,0,0,0,0,0,0,0,0,0,0,0,0,0,0,0,0,0,0,0,0,0,0,0,0,0,0,0,0,0,0,0,0,0,0,0,0,0,0,0,0,0,0,0,0,0,0,0,0,0,0,0,0,0,0,0,0,0,0,0,0,0,0,0,0,0,0,0,0,0,0,0,0,0,0,0,0,0,0,0,0,0,0,0,0,0,0,0,0,0,0,null,null,null,null,null,null,null,null,null,null,null,null,null,null,null,null,null,"22S",null,null,null,null,null,null,null,{"$f":"IF($C$105=$B$106,BY$115,IF($C$105=$B$107,BY$116,IF($C$105=$B$108,BY$117,\"\")))","v":"47E"}]
[0,73,null,"24S","20N",null,0,0,0,0,0,0,0,0,0,0,0,0,0,0,0,0,0,0,0,0,0,0,0,0,0,0,0,0,0,0,0,0,0,0,0,0,0,0,0,0,0,0,0,0,0,0,0,0,0,0,0,0,0,0,0,0,0,0,0,0,0,0,0,0,0,0,0,0,0,0,0,0,0,0,0,0,0,0,0,0,0,0,0,0,0,0,0,0,0,0,0,0,0,0,0,0,0,0,0,null,null,null,null,null,null,null,null,null,null,null,null,null,null,null,null,null,"23S",null,null,null,null,null,null,null,{"$f":"IF($C$105=$B$106,BZ$115,IF($C$105=$B$107,BZ$116,IF($C$105=$B$108,BZ$117,\"\")))","v":0}]
[0,74,null,"25S","19N",null,0,0,0,0,0,0,0,0,0,0,0,0,0,0,0,0,0,0,0,0,0,0,0,0,0,0,0,0,0,0,0,0,0,0,0,0,0,0,0,0,0,0,0,0,0,0,0,0,0,0,0,0,0,0,0,0,0,0,0,0,0,0,0,0,0,0,0,0,0,0,0,0,0,0,0,0,0,0,0,0,0,0,0,0,0,0,0,0,0,0,0,0,0,0,0,0,0,0,0,null,null,null,null,null,null,null,null,null,null,null,null,null,null,null,null,null,"24S",null,null,null,null,null,null,null,{"$f":"IF($C$105=$B$106,CA$115,IF($C$105=$B$107,CA$116,IF($C$105=$B$108,CA$117,\"\")))","v":0}]
[0,75,null,"26S","18N",null,0,0,0,0,0,0,0,0,0,0,0,0,0,0,0,0,0,0,0,0,0,0,0,0,0,0,0,0,0,0,0,0,0,0,0,0,0,0,0,0,0,0,0,0,0,0,0,0,0,0,0,0,0,0,0,0,0,0,0,0,0,0,0,0,0,0,0,0,0,0,0,0,0,0,0,0,0,0,0,0,0,0,0,0,0,0,0,0,0,0,0,0,0,0,0,0,0,0,0,null,null,null,null,null,null,null,null,null,null,null,null,null,null,null,null,null,"25S",null,null,null,null,null,null,null,{"$f":"IF($C$105=$B$106,CB$115,IF($C$105=$B$107,CB$116,IF($C$105=$B$108,CB$117,\"\")))","v":0}]
[0,76,null,"27S","17N",null,0,0,0,0,0,0,0,0,0,0,0,0,0,0,0,0,0,0,0,0,0,0,0,0,0,0,0,0,0,0,0,0,0,0,0,0,0,0,0,0,0,0,0,0,0,0,0,0,0,0,0,0,0,0,0,0,0,0,0,0,0,0,0,0,0,0,0,0,0,0,0,0,0,0,0,0,0,0,0,0,0,0,0,0,0,0,0,0,0,0,0,0,0,0,0,0,0,0,0,null,null,null,null,null,null,null,null,null,null,null,null,null,null,null,null,null,"26S",null,null,null,null,null,null,null,{"$f":"IF($C$105=$B$106,CC$115,IF($C$105=$B$107,CC$116,IF($C$105=$B$108,CC$117,\"\")))","v":0}]
[0,77,null,"28S","16N",null,0,0,0,0,0,0,0,0,0,0,0,0,0,0,0,0,0,0,0,0,0,0,0,0,0,0,0,0,0,0,0,0,0,0,0,0,0,0,0,0,0,0,0,0,0,0,0,0,0,0,0,0,0,0,0,0,0,0,0,0,0,0,0,0,0,0,0,0,0,0,0,0,0,0,0,0,0,0,0,0,0,0,0,0,0,0,0,0,0,0,0,0,0,0,0,0,0,0,0,null,null,null,null,null,null,null,null,null,null,null,null,null,null,null,null,null,"27S",null,null,null,null,null,null,null,{"$f":"IF($C$105=$B$106,CD$115,IF($C$105=$B$107,CD$116,IF($C$105=$B$108,CD$117,\"\")))","v":0}]
[0,78,null,"29S","15N",null,0,0,0,0,0,0,0,0,0,0,0,0,0,0,0,0,0,0,0,0,0,0,0,0,0,0,0,0,0,0,0,0,0,0,0,0,0,0,0,0,0,0,0,0,0,0,0,0,0,0,0,0,0,0,0,0,0,0,0,0,0,0,0,0,0,0,0,0,0,0,0,0,0,0,0,0,0,0,0,0,0,0,0,0,0,0,0,0,0,0,0,0,0,0,0,0,0,0,0,null,null,null,null,null,null,null,null,null,null,null,null,null,null,null,null,null,"28S",null,null,null,null,null,null,null,{"$f":"IF($C$105=$B$106,CE$115,IF($C$105=$B$107,CE$116,IF($C$105=$B$108,CE$117,\"\")))","v":0}]
[0,79,null,"30S","14N",null,0,0,0,0,0,0,0,0,0,0,0,0,0,0,0,0,0,0,0,0,0,0,0,0,0,0,0,0,0,0,0,0,0,0,0,0,0,0,0,0,0,0,0,0,0,0,0,0,0,0,0,0,0,0,0,0,0,0,0,0,0,0,0,0,0,0,0,0,0,0,0,0,0,0,0,0,0,0,0,0,{"$f":"MIN(CI$119,$A199)","v":0},0,0,0,0,0,0,0,0,0,0,0,0,0,0,0,0,0,0,null,null,null,null,null,null,null,null,null,null,null,null,null,null,null,null,null,"29S",null,null,null,null,null,null,null,{"$f":"IF($C$105=$B$106,CF$115,IF($C$105=$B$107,CF$116,IF($C$105=$B$108,CF$117,\"\")))","v":0}]
[0,80,null,"31S","13N",null,0,0,0,0,0,0,0,0,0,0,0,0,0,0,0,0,{"$f":"MIN(W$119,$A200)","v":0},0,0,0,0,0,0,0,0,0,0,0,0,0,0,0,0,0,0,0,0,0,0,0,0,0,0,0,0,0,0,0,0,0,0,0,0,0,0,0,0,0,0,0,0,0,0,0,0,0,0,0,0,0,0,0,0,0,0,0,0,0,0,0,0,0,0,0,0,0,0,0,0,0,0,0,0,0,0,0,0,0,0,null,null,null,null,null,null,null,null,null,null,null,null,null,null,null,null,null,"30S",null,null,null,null,null,null,null,{"$f":"IF($C$105=$B$106,CG$115,IF($C$105=$B$107,CG$116,IF($C$105=$B$108,CG$117,\"\")))","v":0}]
[0,81,null,"32S","12N",null,{"$f":"MIN(G$119,$A201)","v":0},0,0,0,0,0,0,0,0,0,0,0,0,0,0,0,0,0,0,0,0,0,0,0,0,0,0,0,0,0,0,0,0,0,0,0,0,0,0,0,0,0,0,0,0,0,0,0,0,0,0,0,0,0,0,0,0,0,0,0,0,0,0,0,0,0,0,0,0,0,0,0,0,0,0,0,0,0,0,0,0,0,0,0,0,0,0,0,0,0,0,0,0,0,0,0,0,0,0,null,null,null,null,null,null,null,null,null,null,null,null,null,null,null,null,null,"31S",null,null,null,null,null,null,null,{"$f":"IF($C$105=$B$106,CH$115,IF($C$105=$B$107,CH$116,IF($C$105=$B$108,CH$117,\"\")))","v":0}]
[0,82,null,"33S","11N",null,0,0,0,0,0,0,0,0,0,0,0,0,0,0,0,0,0,0,0,0,0,0,0,0,0,0,0,0,0,0,0,0,0,0,0,0,0,0,0,0,0,0,0,0,0,0,0,0,0,0,0,0,0,0,0,0,0,0,0,0,0,0,0,0,0,0,0,0,0,0,0,0,0,0,0,0,0,0,0,0,0,0,0,0,0,0,0,0,0,0,0,0,0,0,0,0,0,0,0,null,null,null,null,null,null,null,null,null,null,null,null,null,null,null,null,null,"32S",null,null,null,null,null,null,null,{"$f":"IF($C$105=$B$106,CI$115,IF($C$105=$B$107,CI$116,IF($C$105=$B$108,CI$117,\"\")))","v":0}]
[0,83,null,null,"10N",null,0,0,0,0,0,0,0,0,0,0,0,0,0,0,0,0,0,0,0,0,0,0,0,0,0,0,0,0,0,0,0,0,0,0,0,0,0,0,0,0,0,0,0,0,0,0,0,{"$f":"MIN(BB$119,$A203)","v":0},0,0,0,0,0,0,0,0,0,0,0,0,0,0,0,{"$f":"MIN(BR$119,$A203)","v":0},0,0,0,0,0,0,0,0,0,0,0,0,0,0,0,0,0,0,0,0,0,0,0,0,0,0,0,0,0,0,0,{"$f":"MIN(CX$119,$A203)","v":0},0,0,0,null,null,null,null,null,null,null,null,null,null,null,null,null,null,null,null,null,"33S",null,null,null,null,null,null,null,{"$f":"IF($C$105=$B$106,CJ$115,IF($C$105=$B$107,CJ$116,IF($C$105=$B$108,CJ$117,\"\")))","v":0}]
[0,84,null,null,"9N",null,0,0,0,0,0,0,0,0,0,0,0,0,0,0,0,0,0,0,0,0,0,0,0,0,0,0,0,0,0,0,0,0,{"$f":"MIN(AM$119,$A204)","v":0},0,0,0,0,0,0,0,0,0,0,0,0,0,0,0,0,0,0,0,0,0,0,0,0,0,0,0,0,0,0,0,0,0,0,0,0,0,0,0,0,0,0,0,0,0,0,{"$f":"MIN(CH$119,$A204)","v":0},0,0,0,0,0,0,0,0,0,0,0,0,0,0,0,0,0,0,0,null,null,null,null,null,null,null,null,null,null,null,null,null,null,null,null,null,0,null,null,null,null,null,null,null,{"$f":"IF($C$105=$B$106,CK$115,IF($C$105=$B$107,CK$116,IF($C$105=$B$108,CK$117,\"\")))","v":0}]
[0,85,null,null,"8N",null,0,0,0,0,0,0,0,0,0,0,0,0,0,0,0,0,0,0,0,0,0,0,0,0,0,0,0,0,0,0,0,0,0,0,0,0,0,0,0,0,0,0,0,0,0,0,0,0,0,0,0,0,0,0,0,0,0,0,0,0,0,0,0,0,0,0,0,0,0,0,0,0,0,0,0,0,0,0,0,0,0,0,0,0,0,0,0,0,0,0,0,0,0,0,0,0,0,0,0,null,null,null,null,null,null,null,null,null,null,null,null,null,null,null,null,null,0,null,null,null,null,null,null,null,{"$f":"IF($C$105=$B$106,CL$115,IF($C$105=$B$107,CL$116,IF($C$105=$B$108,CL$117,\"\")))","v":0}]
[0,86,null,null,"7N",null,0,0,0,0,0,0,0,0,0,0,0,0,0,0,0,0,0,0,0,0,0,0,0,0,0,0,0,0,0,0,0,0,0,0,0,0,0,0,0,0,0,0,0,0,0,0,0,0,0,0,0,0,0,0,0,0,0,0,0,0,0,0,0,0,0,0,0,0,0,0,0,0,0,0,0,0,0,0,0,0,0,0,0,0,0,0,0,0,0,0,0,0,0,0,0,0,0,0,0,null,null,null,null,null,null,null,null,null,null,null,null,null,null,null,null,null,0,null,null,null,null,null,null,null,{"$f":"IF($C$105=$B$106,CM$115,IF($C$105=$B$107,CM$116,IF($C$105=$B$108,CM$117,\"\")))","v":0}]
[0,87,null,null,"6N",null,0,0,0,0,0,0,0,0,0,0,0,0,0,0,0,0,0,0,0,0,0,0,0,0,0,0,0,0,0,0,0,0,0,0,0,0,0,0,0,0,0,0,0,0,0,0,0,0,0,0,0,0,0,0,0,0,0,0,0,0,0,0,0,0,0,0,0,0,0,0,0,0,0,0,0,0,0,0,0,0,0,0,0,0,0,0,0,0,0,0,0,0,0,0,0,0,0,0,0,null,null,null,null,null,null,null,null,null,null,null,null,null,null,null,null,null,0,null,null,null,null,null,null,null,{"$f":"IF($C$105=$B$106,CN$115,IF($C$105=$B$107,CN$116,IF($C$105=$B$108,CN$117,\"\")))","v":0}]
[0,88,null,null,"5N",null,0,0,0,0,0,0,0,0,0,0,0,0,0,0,0,0,0,0,0,0,0,0,0,0,0,0,0,0,0,0,0,0,0,0,0,0,0,0,0,0,0,0,0,0,0,0,0,0,0,0,0,0,0,0,0,0,0,0,0,0,0,0,0,0,0,0,0,0,0,0,0,0,0,0,0,0,0,0,0,0,0,0,0,0,0,0,0,0,0,0,0,0,0,0,0,0,0,0,0,null,null,null,null,null,null,null,null,null,null,null,null,null,null,null,null,null,0,null,null,null,null,null,null,null,{"$f":"IF($C$105=$B$106,CO$115,IF($C$105=$B$107,CO$116,IF($C$105=$B$108,CO$117,\"\")))","v":0}]
[0,89,null,null,"4N",null,0,0,0,0,0,0,0,0,0,0,0,0,0,0,0,0,0,0,0,0,0,0,0,0,0,0,0,0,0,0,0,0,0,0,0,0,0,0,0,0,0,0,0,0,0,0,0,0,0,0,0,0,0,0,0,0,0,0,0,0,0,0,0,0,0,0,0,0,0,0,0,0,0,0,0,0,0,0,0,0,0,0,0,0,0,0,0,0,0,0,0,0,0,0,0,0,0,0,0,null,null,null,null,null,null,null,null,null,null,null,null,null,null,null,null,null,0,null,null,null,null,null,null,null,{"$f":"IF($C$105=$B$106,CP$115,IF($C$105=$B$107,CP$116,IF($C$105=$B$108,CP$117,\"\")))","v":0}]
[0,90,null,null,"3N",null,0,0,0,0,0,0,0,0,0,0,0,0,0,0,0,0,0,0,0,0,0,0,0,0,0,0,0,0,0,0,0,0,0,0,0,0,0,0,0,0,0,0,0,0,0,0,0,0,0,0,0,0,0,0,0,0,0,0,0,0,0,0,0,0,0,0,0,0,0,0,0,0,0,0,0,0,0,0,0,0,0,0,0,0,0,0,0,0,0,0,0,0,0,0,0,0,0,0,0,null,null,null,null,null,null,null,null,null,null,null,null,null,null,null,null,null,0,null,null,null,null,null,null,null,{"$f":"IF($C$105=$B$106,CQ$115,IF($C$105=$B$107,CQ$116,IF($C$105=$B$108,CQ$117,\"\")))","v":0}]
[0,91,null,null,"2N",null,0,0,0,0,0,0,0,0,0,0,0,0,0,0,0,0,0,0,0,0,0,0,0,0,0,0,0,0,0,0,0,0,0,0,0,0,0,0,0,0,0,0,0,0,0,0,0,0,0,0,0,0,0,0,0,0,0,0,0,0,0,0,0,0,0,0,0,0,0,0,0,0,0,0,0,0,0,0,0,0,0,0,0,0,0,0,0,0,0,0,0,0,0,0,0,0,0,0,0,null,null,null,null,null,null,null,null,null,null,null,null,null,null,null,null,null,0,null,null,null,null,null,null,null,{"$f":"IF($C$105=$B$106,CR$115,IF($C$105=$B$107,CR$116,IF($C$105=$B$108,CR$117,\"\")))","v":0}]
[0,92,null,null,"1N",null,0,0,0,0,0,0,0,0,0,0,0,0,0,0,0,0,0,0,0,0,0,0,0,0,0,0,0,0,0,0,0,0,0,0,0,0,0,0,0,0,0,0,0,0,0,0,0,0,0,0,0,0,0,0,0,0,0,0,0,0,0,0,0,0,0,0,0,0,0,0,0,0,0,0,0,0,0,0,0,0,0,0,0,0,0,0,0,0,0,0,0,0,0,0,0,0,0,0,0,null,null,null,null,null,null,null,null,null,null,null,null,null,null,null,null,null,0,null,null,null,null,null,null,null,{"$f":"IF($C$105=$B$106,CS$115,IF($C$105=$B$107,CS$116,IF($C$105=$B$108,CS$117,\"\")))","v":0}]
[0,93,null,null,"1S",null,0,0,0,0,0,0,0,0,0,0,0,0,0,0,0,0,0,0,0,0,0,0,0,0,0,0,0,0,0,0,0,0,0,0,0,0,0,0,0,0,0,0,0,0,0,0,0,0,0,0,0,0,0,0,0,0,0,0,0,0,0,0,0,0,0,0,0,0,0,0,0,0,0,0,0,0,0,0,0,0,0,0,0,0,0,0,0,0,0,0,0,0,0,0,0,0,0,0,0,null,null,null,null,null,null,null,null,null,null,null,null,null,null,null,null,null,0,null,null,null,null,null,null,null,{"$f":"IF($C$105=$B$106,CT$115,IF($C$105=$B$107,CT$116,IF($C$105=$B$108,CT$117,\"\")))","v":0}]
[0,94,null,null,"2S",null,0,0,0,0,0,0,0,0,0,0,0,0,0,0,0,0,0,0,0,0,0,0,0,0,0,0,0,0,0,0,0,0,0,0,0,0,0,0,0,0,0,0,0,0,0,0,0,0,0,0,0,0,0,0,0,0,0,0,0,0,0,0,0,0,0,0,0,0,0,0,0,0,0,0,0,0,0,0,0,0,0,0,0,0,0,0,0,0,0,0,0,0,0,0,0,0,0,0,0,null,null,null,null,null,null,null,null,null,null,null,null,null,null,null,null,null,0,null,null,null,null,null,null,null,{"$f":"IF($C$105=$B$106,CU$115,IF($C$105=$B$107,CU$116,IF($C$105=$B$108,CU$117,\"\")))","v":0}]
[0,95,null,null,"3S",null,0,0,0,0,0,0,0,0,0,0,0,0,0,0,0,0,0,0,0,0,0,0,0,0,0,0,0,0,0,0,0,0,0,0,0,0,0,0,0,0,0,0,0,0,0,0,0,0,0,0,0,0,0,0,0,0,0,0,0,0,0,0,0,0,0,0,0,0,0,0,0,0,0,0,0,0,0,0,0,0,0,0,0,0,0,0,0,0,0,0,0,0,0,0,0,0,0,0,0,null,null,null,null,null,null,null,null,null,null,null,null,null,null,null,null,null,0,null,null,null,null,null,null,null,{"$f":"IF($C$105=$B$106,CV$115,IF($C$105=$B$107,CV$116,IF($C$105=$B$108,CV$117,\"\")))","v":0}]
[0,96,null,null,"4S",null,0,0,0,0,0,0,0,0,0,0,0,0,0,0,0,{"$f":"MIN(V$119,$A216)","v":0},0,0,0,0,0,0,0,0,0,0,0,0,0,0,0,{"$f":"MIN(AL$119,$A216)","v":0},0,0,0,0,0,0,0,0,0,0,0,0,0,0,0,0,0,0,0,0,0,0,0,0,0,0,0,0,0,0,0,0,0,0,0,0,0,0,0,0,0,0,0,0,0,0,0,0,0,0,0,0,0,0,0,0,0,0,0,0,0,0,0,0,0,0,0,null,null,null,null,null,null,null,null,null,null,null,null,null,null,null,null,null,0,null,null,null,null,null,null,null,{"$f":"IF($C$105=$B$106,CW$115,IF($C$105=$B$107,CW$116,IF($C$105=$B$108,CW$117,\"\")))","v":0}]
[0,97,null,null,"5S",null,{"$f":"MIN(G$119,$A217)","v":0},0,0,0,0,0,0,0,0,0,0,0,0,0,0,0,0,0,0,0,0,0,0,0,0,0,0,0,0,0,0,0,0,0,0,0,0,0,0,0,0,0,0,0,0,0,0,0,0,0,0,0,0,0,0,0,0,0,0,0,0,0,0,0,0,0,0,0,0,0,0,0,0,0,0,0,0,0,0,0,0,0,0,0,0,0,0,0,0,0,0,0,0,0,0,0,0,0,0,null,null,null,null,null,null,null,null,null,null,null,null,null,null,null,null,null,0,null,null,null,null,null,null,null,{"$f":"IF($C$105=$B$106,CX$115,IF($C$105=$B$107,CX$116,IF($C$105=$B$108,CX$117,\"\")))","v":0}]
[0,98,null,null,"6S",null,0,0,0,0,0,0,0,0,0,0,0,0,0,0,0,0,0,0,0,0,0,0,0,0,0,0,0,0,0,0,0,0,0,0,0,0,0,0,0,0,0,0,0,0,0,0,0,0,0,0,0,0,0,0,0,0,0,0,0,0,0,0,0,0,0,0,0,0,0,0,0,0,0,0,0,0,0,0,{"$f":"MIN(CG$119,$A218)","v":0},0,0,0,0,0,0,0,0,0,0,0,0,0,0,0,0,0,0,0,0,null,null,null,null,null,null,null,null,null,null,null,null,null,null,null,null,null,0,null,null,null,null,null,null,null,{"$f":"IF($C$105=$B$106,CY$115,IF($C$105=$B$107,CY$116,IF($C$105=$B$108,CY$117,\"\")))","v":0}]
[0,99,null,null,"7S",null,0,0,0,0,0,0,0,0,0,0,0,0,0,0,0,0,0,0,0,0,0,0,0,0,0,0,0,0,0,0,0,0,0,0,0,0,0,0,0,0,0,0,0,0,0,0,0,0,{"$f":"MIN(BC$119,$A219)","v":0},0,0,0,0,0,0,0,0,0,0,0,0,0,0,0,{"$f":"MIN(BS$119,$A219)","v":0},0,0,0,0,0,0,0,0,0,0,0,0,0,0,0,0,0,0,0,0,0,0,0,0,0,0,0,0,0,0,0,0,0,0,null,null,null,null,null,null,null,null,null,null,null,null,null,null,null,null,null,0,null,null,null,null,null,null,null,{"$f":"IF($C$105=$B$106,CZ$115,IF($C$105=$B$107,CZ$116,IF($C$105=$B$108,CZ$117,\"\")))","v":0}]
[0,100,null,null,"8S",null,0,0,0,0,0,0,0,0,0,0,0,0,0,0,0,0,0,0,0,0,0,0,0,0,0,0,0,0,0,0,0,0,0,0,0,0,0,0,0,0,0,0,0,0,0,0,0,{"$f":"MIN(BB$119,$A220)","v":0},0,0,0,0,0,0,0,0,0,0,0,0,0,0,0,0,0,0,0,0,0,0,0,0,0,0,0,0,0,0,0,0,0,0,0,0,0,0,0,0,0,0,0,0,0,0,0,0,0,0,0,null,null,null,null,null,null,null,null,null,null,null,null,null,null,null,null,null,0,null,null,null,null,null,null,null,{"$f":"IF($C$105=$B$106,DA$115,IF($C$105=$B$107,DA$116,IF($C$105=$B$108,DA$117,\"\")))","v":0}]
[0,101,null,null,"9S",null,0,0,0,0,0,0,0,0,0,0,0,0,0,0,0,0,0,0,0,0,0,0,0,0,0,0,0,0,0,0,0,0,0,0,0,0,0,0,0,0,0,0,0,0,0,0,0,0,0,0,0,0,0,0,0,0,0,0,0,0,0,0,0,0,0,0,0,0,0,0,0,0,0,0,0,0,0,0,0,0,0,0,0,0,0,0,0,0,0,0,0,0,0,0,0,0,0,0,0,null,null,null,null,null,null,null,null,null,null,null,null,null,null,null,null,null,0]
[0,102,null,null,"10S",null,0,0,0,0,0,0,0,0,0,0,0,0,0,0,0,0,0,0,0,0,0,0,0,0,0,0,0,0,0,0,0,0,0,0,0,0,0,0,0,0,0,0,0,0,0,0,0,0,0,0,0,0,0,0,0,0,0,0,0,0,0,0,0,0,0,0,0,0,0,0,0,0,0,0,0,0,0,0,0,0,0,0,0,0,0,0,0,0,0,0,0,0,0,0,0,0,0,0,0,null,null,null,null,null,null,null,null,null,null,null,null,null,null,null,null,null,0]
[0,103,null,null,"11S",null,0,0,0,0,0,0,0,0,0,0,0,0,0,0,0,0,0,0,0,0,0,0,0,0,0,0,0,0,0,0,0,0,0,0,0,0,0,0,0,0,0,0,0,0,0,0,0,0,0,0,0,0,0,0,0,0,0,0,0,0,0,0,0,0,0,0,0,0,0,0,0,0,0,0,0,0,0,0,0,0,0,0,0,0,0,0,0,0,0,0,0,0,0,0,{"$f":"MIN(CW$119,$A223)","v":0},0,0,0,0,null,null,null,null,null,null,null,null,null,null,null,null,null,null,null,null,null,0]
[0,104,null,null,"12S",null,0,0,0,0,0,0,0,0,0,0,0,0,0,0,0,0,0,0,0,0,0,0,0,0,0,0,0,0,0,0,0,0,0,0,0,0,0,0,0,0,0,0,0,0,0,0,0,0,0,0,0,0,0,0,0,0,0,0,0,0,0,0,0,0,0,0,0,0,0,0,0,0,0,0,0,0,0,0,0,0,0,0,0,0,0,0,0,0,0,0,0,0,0,0,0,0,0,0,0,null,null,null,null,null,null,null,null,null,null,null,null,null,null,null,null,null,0]
[0,105,null,null,"13S",null,0,0,0,0,0,0,0,0,0,0,0,0,0,0,0,0,0,0,0,0,0,0,0,0,0,0,0,0,0,0,0,0,0,0,0,0,0,0,0,0,0,0,0,0,0,0,0,0,0,0,0,0,0,0,0,0,0,0,0,0,0,0,0,0,0,0,0,0,0,0,0,0,0,0,0,0,0,0,0,0,0,0,0,0,0,0,0,0,0,0,0,0,0,0,0,0,0,0,0,null,null,null,null,null,null,null,null,null,null,null,null,null,null,null,null,null,0]
[0,106,null,null,"14S",null,0,0,0,0,0,0,0,0,0,0,0,0,0,0,0,0,0,0,0,0,0,0,0,0,0,0,0,0,0,0,0,0,0,0,0,0,0,0,0,0,0,0,0,0,0,0,0,0,0,0,0,0,0,0,0,0,0,0,0,0,0,0,0,0,0,0,0,0,0,0,0,0,0,0,0,0,0,0,0,0,0,0,0,0,0,0,0,0,0,0,0,0,0,0,0,0,0,0,0,null,null,null,null,null,null,null,null,null,null,null,null,null,null,null,null,null,0]
[0,107,null,null,"15S",null,0,0,0,0,0,0,0,0,0,0,0,0,0,0,0,0,0,0,0,0,0,0,0,0,0,0,0,0,0,0,0,0,0,0,0,0,0,0,0,0,0,0,0,0,0,0,0,0,0,0,0,0,0,0,0,0,0,0,0,0,0,0,0,0,0,0,0,0,0,0,0,0,0,0,0,0,0,0,0,0,0,0,0,0,0,0,0,0,0,0,0,0,0,0,0,0,0,0,0,null,null,null,null,null,null,null,null,null,null,null,null,null,null,null,null,null,0]
[0,108,null,null,"16S",null,0,0,0,0,0,0,0,0,0,0,0,0,0,0,0,0,0,0,0,0,0,0,0,0,0,0,0,0,0,0,0,0,0,0,0,0,0,0,0,0,0,0,0,0,0,0,0,0,0,0,0,0,0,0,0,0,0,0,0,0,0,0,0,0,0,0,0,0,0,0,0,0,0,0,0,0,0,0,0,0,0,0,0,0,0,0,0,0,0,0,0,0,0,0,0,0,0,0,0,null,null,null,null,null,null,null,null,null,null,null,null,null,null,null,null,null,0]
[0,109,null,null,"17S",null,0,0,0,0,0,0,0,0,0,0,0,0,0,0,0,0,0,0,0,0,0,0,0,0,0,0,0,0,0,0,0,0,0,0,0,0,0,0,0,0,0,0,0,0,0,0,0,0,0,0,0,0,0,0,0,0,0,0,0,0,0,0,0,0,0,0,0,0,0,0,0,0,0,0,0,0,0,0,0,0,0,0,0,0,0,0,0,0,0,0,0,0,0,0,0,0,0,0,0,null,null,null,null,null,null,null,null,null,null,null,null,null,null,null,null,null,0]
[0,110,null,null,"18S",null,0,0,0,0,0,0,0,0,0,0,0,0,0,0,0,0,0,0,0,0,0,0,0,0,0,0,0,0,0,0,0,0,0,0,0,0,0,0,0,0,0,0,0,0,0,0,0,0,0,0,0,0,0,0,0,0,0,0,0,0,0,0,0,0,0,0,0,0,0,0,0,0,0,0,0,0,0,0,0,0,0,0,0,0,0,0,0,0,0,0,0,0,0,0,0,0,0,0,0,null,null,null,null,null,null,null,null,null,null,null,null,null,null,null,null,null,0]
[0,111,null,null,"19S",null,0,0,0,0,0,0,0,0,0,0,0,0,0,0,0,0,0,0,0,0,0,0,0,0,0,0,0,0,0,0,{"$f":"MIN(AK$119,$A231)","v":0},0,0,0,0,0,0,0,0,0,0,0,0,0,0,0,0,0,0,0,0,0,0,0,0,0,0,0,0,0,0,0,0,0,0,0,0,0,0,0,0,0,0,0,0,0,0,0,0,0,0,0,0,0,0,0,0,0,0,0,0,0,0,{"$f":"MIN(CV$119,$A231)","v":0},0,0,0,0,0,null,null,null,null,null,null,null,null,null,null,null,null,null,null,null,null,null,0]

{"sheet":"Calcs","index":8,"n_rows":237,"n_cols":131,"rows_kept":237,"cut":false,"hidden":true,"merged":[]}
[null,"Zone Selection",{"$f":"H111","v":16},null,"Crop",1,null,"Practice",1,null,"Soil",1,null,"Etc",{"$f":"IF(C1=1,LOOKUP(F1,A5:A67,C5:C67), IF(C1=2,LOOKUP(F1,A5:A67,D5:D67),IF(C1=3,LOOKUP(F1,A5:A67,E5:E67),IF(C1=4,LOOKUP(F1,A5:A67,F5:F67), IF(C1=5,LOOKUP(F1,A5:A67,G5:G67), IF(C1=6,LOOKUP(F1,A5:A67,H5:H67),P1))))))","v":63},{"$f":"IF(C1=7,LOOKUP(F1,A5:A67,I5:I67), IF(C1=8,LOOKUP(F1,A5:A67,J5:J67),IF(C1=9,LOOKUP(F1,A5:A67,K5:K67),IF(C1=10,LOOKUP(F1,A5:A67,L5:L67), IF(C1=11,LOOKUP(F1,A5:A67,M5:M67), IF(C1=12,LOOKUP(F1,A5:A67,N5:N67),Q1))))))","v":63},{"$f":"IF(C1=13,LOOKUP(F1,A5:A67,O5:O67), IF(C1=14,LOOKUP(F1,A5:A67,P5:P67),IF(C1=15,LOOKUP(F1,A5:A67,Q5:Q67),IF(C1=16,LOOKUP(F1,A5:A67,R5:R67), IF(C1=17,LOOKUP(F1,A5:A67,S5:S67), IF(C1=18,LOOKUP(F1,A5:A67,T5:T67),\"N/A\"))))))","v":63},null,"Eb",{"$f":"IF(L1=1,LOOKUP(I1,A72:A91,C72:C91), IF(L1=2,LOOKUP(I1,A72:A91,D72:D91),IF(L1=3,LOOKUP(I1,A72:A91,E72:E91),IF(L1=4,LOOKUP(I1,A72:A91,F72:F91), IF(L1=5,LOOKUP(I1,A72:A91,G72:G91), IF(L1=6,LOOKUP(I1,A72:A91,H72:H91),IF(L1=7,LOOKUP(I1,A72:A91,I72:I91), U1)))))))","v":60},{"$f":"IF(L1=8,LOOKUP(I1,A72:A91,J72:J91), IF(L1=9,LOOKUP(I1,A72:A91,K72:K91), \"N/A\"))","v":"N/A"},null,"Ea",{"$f":"IF(L1=1,LOOKUP(I1,A72:A91,M72:M91), IF(L1=2,LOOKUP(I1,A72:A91,N72:N91),IF(L1=3,LOOKUP(I1,A72:A91,O72:O91),IF(L1=4,LOOKUP(I1,A72:A91,P72:P91), IF(L1=5,LOOKUP(I1,A72:A91,Q72:Q91), IF(L1=6,LOOKUP(I1,A72:A91,R72:R91),IF(L1=7,LOOKUP(I1,A72:A91,S72:S91), Y1)))))))","v":60},{"$f":"IF(L1=8,LOOKUP(I1,A72:A91,T72:T91), IF(L1=9,LOOKUP(I1,A72:A91,U72:U91), \"N/A\"))","v":"N/A"},null,"Wb",{"$f":"(O1/(T1/100))","v":105},null,"Wa",{"$f":"(O1/(X1/100))","v":105},null,"Crop Notes",{"$f":"(LOOKUP(F1,A5:A67,U5:U67))","v":"ET Based on NRCS state office Aug,2000 (annual) (planting 1/1 and harvesting 12/31)"},null,null,null,null,null,null,null,null,null,null,null,null,"IWM level:",1,null,null,null,null,null,{"$f":"B1","v":"Zone Selection"},{"$f":"C1","v":16},null,{"$f":"E1","v":"Crop"},{"$f":"F1","v":1},null,null,null,null,null,null,null,"Peak Daily ET",{"$f":"IF(BC1=1,LOOKUP(BF1,BA5:BA67,BC5:BC67), IF(BC1=2,LOOKUP(BF1,BA5:BA67,BD5:BD67),IF(BC1=3,LOOKUP(BF1,BA5:BA67,BE5:BE67),IF(BC1=4,LOOKUP(BF1,BA5:BA67,BF5:BF67), IF(BC1=5,LOOKUP(BF1,BA5:BA67,BG5:BG67), IF(BC1=6,LOOKUP(BF1,BA5:BA67,BH5:BH67),BP1))))))","v":0.31},{"$f":"IF(BC1=7,LOOKUP(BF1,BA5:BA67,BI5:BI67), IF(BC1=8,LOOKUP(BF1,BA5:BA67,BJ5:BJ67),IF(BC1=9,LOOKUP(BF1,BA5:BA67,BK5:BK67),IF(BC1=10,LOOKUP(BF1,BA5:BA67,BL5:BL67), IF(BC1=11,LOOKUP(BF1,BA5:BA67,BM5:BM67), IF(BC1=12,LOOKUP(BF1,BA5:BA67,BN5:BN67),BQ1))))))","v":0.31},{"$f":"IF(BC1=13,LOOKUP(BF1,BA5:BA67,BO5:BO67), IF(BC1=14,LOOKUP(BF1,BA5:BA67,BP5:BP67),IF(BC1=15,LOOKUP(BF1,BA5:BA67,BQ5:BQ67),IF(BC1=16,LOOKUP(BF1,BA5:BA67,BR5:BR67), IF(BC1=17,LOOKUP(BF1,BA5:BA67,BS5:BS67), IF(BC1=18,LOOKUP(BF1,BA5:BA67,BT5:BT67),0))))))","v":0.31},{"$f":"IF(BF1=24,BV28,\"\")","v":""}]
[null,null,null,null,null,null,null,null,null,null,null,null,null,null,null,null,null,null,null,null,null,null,null,null,null,null,null,null,null,null,null,null,null,null,null,null,null,null,null,null,null,null,null,null,null,null,"IWM % savings:",{"$f":"IF(AV1=1,0,IF(AV1=2,0.05,IF(AV1=3,0.1,IF(AV1=4,0.15))))","v":0}]
["Note:  These values are seasonal estimates based on NRCS California Consumptive Database Aug. 2000",null,1,2,3,4,5,6,7,8,9,10,11,12,13,14,15,16,17,18,null,null,null,null,null,null,null,null,null,null,null,null,null,null,null,null,null,null,null,null,null,null,null,null,null,null,null,null,null,null,null,null,"Note:  These values Peak Daily ET Values are seasonal estimates based on NRCS California Consumptive Database Aug. 2000",null,1,2,3,4,5,6,7,8,9,10,11,12,13,14,15,16,17,18]
[null,null,"Zone 1","Zone 2","Zone 3","Zone 4","Zone 5","Zone 6","Zone 7","Zone 8","Zone 9","Zone 10","Zone 11","Zone 12","Zone 13","Zone 14","Zone 15","Zone 16","Zone 17","Zone 18","Notes",null,null,null,null,null,null,null,null,null,null,null,null,null,null,null,null,null,null,null,null,null,null,null,null,null,null,null,null,null,null,null,null,null,"Zone 1","Zone 2","Zone 3","Zone 4","Zone 5","Zone 6","Zone 7","Zone 8","Zone 9","Zone 10","Zone 11","Zone 12","Zone 13","Zone 14","Zone 15","Zone 16","Zone 17","Zone 18","Notes"]
[1,"Alfalfa",33,39,46,47,44,50,44,50,55,49,53,53,55,57,58,63,67,72,"ET Based on NRCS state office Aug,2000 (annual) (planting 1/1 and harvesting 12/31)",null,null,null,null,null,null,null,null,null,null,null,null,null,null,null,null,null,null,null,null,null,null,null,null,null,null,null,null,null,null,null,1,"Alfalfa",0.15,0.18,0.19,0.19,0.21,0.21,0.25,0.25,0.25,0.27,0.27,0.26,0.3,0.28999999999999998,0.28999999999999998,0.31,0.33,0.33,"ET Based on NRCS state office Aug,2000 (annual) (planting 1/1 and harvesting 12/31)"]
[{"$f":"A5+1","v":2},"Almonds",25,29,33,34,35,36,36,39,41,40,41,42,44,45,46,49,52,54,"ET Based on NRCS state office Aug,2000 (planting 3/1 and harvesting 10/15)",null,null,null,null,null,null,null,null,null,null,null,null,null,null,null,null,null,null,null,null,null,null,null,null,null,null,null,null,null,null,null,{"$f":"BA5+1","v":2},"Almonds",0.16,0.18,0.2,0.2,0.22,0.22,0.26,0.26,0.26,0.28000000000000003,0.28000000000000003,0.27,0.32,0.3,0.3,0.32,0.35,0.34,"ET Based on NRCS state office Aug,2000 (planting 3/1 and harvesting 10/15)"]
[{"$f":"A6+1","v":3},"Apple",24,28,32,32,33,35,34,37,39,38,40,40,42,43,44,47,49,51,"ET Based on NRCS state office Aug,2000 (planting 4/11 and harvesting 11/15)",null,null,null,null,null,null,null,null,null,null,null,null,null,null,null,null,null,null,null,null,null,null,null,null,null,null,null,null,null,null,null,{"$f":"BA6+1","v":3},"Apple",0.15,0.16,0.19,0.2,0.21,0.22,0.25,0.25,0.25,0.27,0.27,0.26,0.3,0.28999999999999998,0.28999999999999998,0.31,0.33,0.32,"ET Based on NRCS state office Aug,2000 (planting 4/11 and harvesting 11/15)"]
[4,"Artichokes",20,24,29,29,26,30,25,29,35,29,32,31,32,34,34,37,40,43,"ET Based on NRCS state office Aug,2000 (planting 7/1 and harvesting 5/1)",null,null,null,null,null,null,null,null,null,null,null,null,null,null,null,null,null,null,null,null,null,null,null,null,null,null,null,null,null,null,null,4,"Artichokes",0.11,0.12,0.14000000000000001,0.15,0.15,0.16,0.17,0.17,0.18,0.18,0.19,0.18,0.2,0.2,0.2,0.22,0.22,0.23,"ET Based on NRCS state office Aug,2000 (planting 7/1 and harvesting 5/1)"]
[5,"Asparagus",30,36,42,42,41,45,41,46,50,46,49,50,51,53,54,58,62,66,"ET Based on NRCS state office Aug,2000 (planting 1/1 and harvesting 12/31)",null,null,null,null,null,null,null,null,null,null,null,null,null,null,null,null,null,null,null,null,null,null,null,null,null,null,null,null,null,null,null,5,"Asparagus",0.15,0.18,0.19,0.19,0.21,0.21,0.25,0.25,0.25,0.27,0.27,0.26,0.3,0.28999999999999998,0.28999999999999998,0.31,0.33,0.33,"ET Based on NRCS state office Aug,2000 (planting 1/1 and harvesting 12/31)"]
[6,"Avocado",23,27,33,33,31,35,31,35,39,35,37,37,38,40,41,44,47,50,"ET Based on NRCS state office Aug,2000 (planting 1/1 and harvesting 12/31)",null,null,null,null,null,null,null,null,null,null,null,null,null,null,null,null,null,null,null,null,null,null,null,null,null,null,null,null,null,null,null,6,"Avocado",0.11,0.12,0.14000000000000001,0.13,0.15,0.15,0.17,0.17,0.17,0.19,0.19,0.18,0.21,0.2,0.2,0.21,0.23,0.23,"ET Based on NRCS state office Aug,2000 (planting 1/1 and harvesting 12/31)"]
[7,"Barley (planting 11/30)",11,13,16,15,13,16,12,15,18,14,15,16,15,17,17,19,20,23,"ET Based on NRCS state office Aug,2000 (planting 11/30 and harvesting 5/31)",null,null,null,null,null,null,null,null,null,null,null,null,null,null,null,null,null,null,null,null,null,null,null,null,null,null,null,null,null,null,null,7,"Barley (planting 11/30)",0.13,0.15,0.18,0.22,0.16,0.18,0.15,0.18,0.2,0.17,0.17,0.2,0.18,0.2,0.22,0.22,0.23,0.26,"ET Based on NRCS state office Aug,2000 (planting 11/30 and harvesting 5/31)"]
[8,"Barley (planting 4/30)",13,15,17,17,19,19,21,21,21,23,23,23,25,25,25,27,28,28,"ET Based on NRCS state office Aug,2000 (planting 4/30 and harvesting 8/31)",null,null,null,null,null,null,null,null,null,null,null,null,null,null,null,null,null,null,null,null,null,null,null,null,null,null,null,null,null,null,null,8,"Barley (planting 4/30)",0.17,0.2,0.22,0.22,0.24,0.24,0.28999999999999998,0.28000000000000003,0.28000000000000003,0.31,0.31,0.3,0.35,0.28999999999999998,0.33,0.35,0.38,0.37,"ET Based on NRCS state office Aug,2000 (planting 4/30 and harvesting 8/31)"]
[9,"Beans (dry)",10,11,12,13,13,14,15,15,16,18,18,19,18,20,20,22,20,20,"ET Based on NRCS state office Aug,2000 (planting 5/1 and harvesting 8/15)",null,null,null,null,null,null,null,null,null,null,null,null,null,null,null,null,null,null,null,null,null,null,null,null,null,null,null,null,null,null,null,9,"Beans (dry)",0.15,0.18,0.19,0.19,0.21,0.21,0.25,0.25,0.25,0.27,0.27,0.26,0.3,0.28999999999999998,0.28999999999999998,0.31,0.33,0.33,"ET Based on NRCS state office Aug,2000 (planting 5/1 and harvesting 8/15)"]
[10,"Beans (Green)",7,8,10,10,9,10,9,11,11,10,10,12,11,12,13,13,14,15,"ET Based on NRCS state office Aug,2000 (planting 3/1 and harvesting 5/31)",null,null,null,null,null,null,null,null,null,null,null,null,null,null,null,null,null,null,null,null,null,null,null,null,null,null,null,null,null,null,null,10,"Beans (Green)",0.13,0.15,0.17,0.17,0.19,0.19,0.18,0.21,0.2,0.2,0.2,0.23,0.22,0.23,0.25,0.26,0.27,0.28999999999999998,"ET Based on NRCS state office Aug,2000 (planting 3/1 and harvesting 5/31)"]
[11,"Beets",9,10,12,11,12,12,11,13,13,13,13,14,14,14,15,16,17,19,"ET Based on NRCS state office Aug,2000 (planting 4/1 and harvesting 6/20)",null,null,null,null,null,null,null,null,null,null,null,null,null,null,null,null,null,null,null,null,null,null,null,null,null,null,null,null,null,null,null,11,"Beets",0.14000000000000001,0.16,0.18,0.17,0.19,0.19,0.19,0.21,0.2,0.22,0.22,0.23,0.24,0.24,0.25,0.26,0.27,0.3,"ET Based on NRCS state office Aug,2000 (planting 4/1 and harvesting 6/20)"]
[12,"Broccoli",10,12,14,13,14,14,14,16,15,16,16,17,17,17,19,20,20,22,"ET Based on NRCS state office Aug,2000 (planting 3/15 and harvesting 7/1)",null,null,null,null,null,null,null,null,null,null,null,null,null,null,null,null,null,null,null,null,null,null,null,null,null,null,null,null,null,null,null,12,"Broccoli",0.15,0.17,0.19,0.19,0.21,0.21,0.21,0.23,0.22,0.24,0.24,0.26,0.26,0.26,0.27,0.28999999999999998,0.3,0.32,"ET Based on NRCS state office Aug,2000 (planting 3/15 and harvesting 7/1)"]
[13,"Carrots",11,14,18,18,14,18,12,16,20,14,17,16,16,18,18,20,22,25,"ET Based on NRCS state office Aug,2000  (planting 9/30 and harvesting 4/30)",null,null,null,null,null,null,null,null,null,null,null,null,null,null,null,null,null,null,null,null,null,null,null,null,null,null,null,null,null,null,null,13,"Carrots",0.11,0.13,0.15,0.15,0.15,0.16,0.14000000000000001,0.16,0.17,0.15,0.15,0.18,0.17,0.18,0.2,0.2,0.21,0.23,"ET Based on NRCS state office Aug,2000  (planting 9/30 and harvesting 4/30)"]
[14,"Celery",6,7,9,10,7,10,6,8,11,7,10,8,9,10,9,11,11,13,"ET Based on NRCS state office Aug,2000 (planting 9/15 and harvesting 1/15)",null,null,null,null,null,null,null,null,null,null,null,null,null,null,null,null,null,null,null,null,null,null,null,null,null,null,null,null,null,null,null,14,"Celery",0.09,0.1,0.11,0.12,0.12,0.13,0.13,0.13,0.15,0.13,0.15,0.14000000000000001,0.15,0.15,0.15,0.17,0.17,0.18,"ET Based on NRCS state office Aug,2000 (planting 9/15 and harvesting 1/15)"]
[15,"Cereal Grains",11,14,17,16,14,17,12,15,19,14,16,16,16,18,18,19,21,25,"ET Based on NRCS state office Aug,2000 (planting 11/1 and harvesting 5/31)",null,null,null,null,null,null,null,null,null,null,null,null,null,null,null,null,null,null,null,null,null,null,null,null,null,null,null,null,null,null,null,15,"Cereal Grains",0.12,0.14000000000000001,0.17,0.16,0.15,0.17,0.14000000000000001,0.17,0.19,0.16,0.16,0.18,0.17,0.18,0.2,0.2,0.22,0.25,"ET Based on NRCS state office Aug,2000 (planting 11/1 and harvesting 5/31)"]
[16,"Citrus",22,26,31,31,29,33,29,33,37,33,36,36,37,38,39,42,45,48,"ET Based on NRCS state office Aug,2000 (planting 1/1 and harvesting 12/31)",null,null,null,null,null,null,null,null,null,null,null,null,null,null,null,null,null,null,null,null,null,null,null,null,null,null,null,null,null,null,null,16,"Citrus",0.1,0.12,0.13,0.13,0.14000000000000001,0.14000000000000001,0.17,0.17,0.17,0.18,0.18,0.17,0.2,0.19,0.19,0.21,0.22,0.22,"ET Based on NRCS state office Aug,2000 (planting 1/1 and harvesting 12/31)"]
[17,"Corn (planting 6/17)",12,13,15,16,16,17,17,18,19,19,20,19,21,21,21,23,24,24,"ET Based on NRCS state office Aug,2000 (silage) (planting 6/17 and harvesting 10/20)",null,null,null,null,null,null,null,null,null,null,null,null,null,null,null,null,null,null,null,null,null,null,null,null,null,null,null,null,null,null,null,17,"Corn (planting 6/17)",0.14000000000000001,0.17,0.19,0.2,0.21,0.22,0.23,0.23,0.24,0.26,0.27,0.26,0.28000000000000003,0.28000000000000003,0.28000000000000003,0.3,0.31,0.31,"ET Based on NRCS state office Aug,2000 (silage) (planting 6/17 and harvesting 10/20)"]
[18,"Corn (planting 3/16)",16,18,20,20,22,22,23,25,24,25,25,27,28,28,29,31,32,33,"ET Based on NRCS state office Aug,2000 (Grain) (planting 3/16 and harvesting 8/15)",null,null,null,null,null,null,null,null,null,null,null,null,null,null,null,null,null,null,null,null,null,null,null,null,null,null,null,null,null,null,null,18,"Corn (planting 3/16)",0.17,0.19,0.21,0.21,0.23,0.23,0.26,0.27,0.26,0.28999999999999998,0.28999999999999998,0.28999999999999998,0.32,0.31,0.31,0.33,0.36,0.36,"ET Based on NRCS state office Aug,2000 (Grain) (planting 3/16 and harvesting 8/15)"]
[19,"Cotton",17,19,21,22,23,24,25,26,27,28,29,28,31,30,31,33,35,35,"ET Based on NRCS state office Aug,2000 (planting 4/16 and harvesting 10/15)",null,null,null,null,null,null,null,null,null,null,null,null,null,null,null,null,null,null,null,null,null,null,null,null,null,null,null,null,null,null,null,19,"Cotton",0.17,0.18,0.2,0.21,0.23,0.23,0.28000000000000003,0.27,0.27,0.3,0.28999999999999998,0.28999999999999998,0.33,0.32,0.32,0.34,0.36,0.34,"ET Based on NRCS state office Aug,2000 (planting 4/16 and harvesting 10/15)"]
[20,"Crucifers",6,7,9,9,8,10,8,9,11,9,10,10,10,11,11,12,12,13,"ET Based on NRCS state office Aug,2000 (planting 8/1 and harvesting 11/15)",null,null,null,null,null,null,null,null,null,null,null,null,null,null,null,null,null,null,null,null,null,null,null,null,null,null,null,null,null,null,null,20,"Crucifers",0.09,0.1,0.12,0.12,0.11,0.13,0.11,0.13,0.15,0.12,0.14000000000000001,0.14000000000000001,0.14000000000000001,0.15,0.15,0.16,0.16,0.18,"ET Based on NRCS state office Aug,2000 (planting 8/1 and harvesting 11/15)"]
[21,"Cucumber",9,11,12,12,12,13,11,13,14,13,13,15,14,15,16,17,17,19,"ET Based on NRCS state office Aug,2000 (planting 3/15 and harvesting 6/15)",null,null,null,null,null,null,null,null,null,null,null,null,null,null,null,null,null,null,null,null,null,null,null,null,null,null,null,null,null,null,null,21,"Cucumber",0.13,0.15,0.17,0.16,0.18,0.18,0.18,0.19,0.19,0.2,0.2,0.22,0.22,0.22,0.23,0.25,0.25,0.28000000000000003,"ET Based on NRCS state office Aug,2000 (planting 3/15 and harvesting 6/15)"]
[22,"Eggplant",23,26,30,31,31,33,32,35,37,36,37,38,40,40,41,44,46,48,"ET Based on NRCS state office Aug,2000 (planting 4/1 and harvesting 11/15)",null,null,null,null,null,null,null,null,null,null,null,null,null,null,null,null,null,null,null,null,null,null,null,null,null,null,null,null,null,null,null,22,"Eggplant",0.13,0.15,0.16,0.17,0.18,0.18,0.22,0.22,0.22,0.23,0.23,0.23,0.26,0.25,0.25,0.27,0.28999999999999998,0.27,"ET Based on NRCS state office Aug,2000 (planting 4/1 and harvesting 11/15)"]
[23,"Evergreen",20,24,28,28,26,30,26,30,33,30,32,32,33,34,35,38,40,43,"ET Based on NRCS state office Aug,2000 (planting 1/1 and harvesting 12/31)",null,null,null,null,null,null,null,null,null,null,null,null,null,null,null,null,null,null,null,null,null,null,null,null,null,null,null,null,null,null,null,23,"Evergreen",0.09,0.11,0.12,0.11,0.13,0.13,0.15,0.15,0.15,0.16,0.16,0.16,0.18,0.17,0.17,0.18,0.2,0.2,"ET Based on NRCS state office Aug,2000 (planting 1/1 and harvesting 12/31)"]
[24,"Grapevines",19,22,24,25,26,27,27,29,30,30,31,32,33,33,34,37,38,40,"ET Based on NRCS state office Aug,2000 (planting 4/1 and harvesting 11/1)",null,null,null,null,null,null,null,null,null,null,null,null,null,null,null,null,null,null,null,null,null,null,null,null,null,null,null,null,null,null,null,24,"Grapevines",0.12,0.14000000000000001,0.16,0.15,0.17,0.17,0.2,0.2,0.2,0.21,0.21,0.21,0.24,0.23,0.23,0.25,0.26,0.26,"ET Based on NRCS state office Aug,2000 (planting 4/1 and harvesting 11/1)","Use 80% peak daily ET due to deficit irrigation"]
[25,"Kiwifruit",23,26,29,30,32,33,34,36,37,37,38,39,41,41,42,45,47,48,"ET Based on NRCS state office Aug,2000 (planting 5/1 and harvesting 10/31)",null,null,null,null,null,null,null,null,null,null,null,null,null,null,null,null,null,null,null,null,null,null,null,null,null,null,null,null,null,null,null,25,"Kiwifruit",0.17,0.19,0.21,0.21,0.23,0.23,0.28000000000000003,0.27,0.27,0.3,0.28999999999999998,0.28999999999999998,0.33,0.32,0.32,0.34,0.36,0.36,"ET Based on NRCS state office Aug,2000 (planting 5/1 and harvesting 10/31)"]
[26,"Lentil",10,11,13,13,14,15,16,16,17,17,18,17,16,19,19,20,21,21,"ET Based on NRCS state office Aug,2000 (planting 6/15 and harvesting 9/30)",null,null,null,null,null,null,null,null,null,null,null,null,null,null,null,null,null,null,null,null,null,null,null,null,null,null,null,null,null,null,null,26,"Lentil",0.15,0.16,0.18,0.19,0.21,0.21,0.24,0.24,0.24,0.26,0.26,0.25,0.28999999999999998,0.28000000000000003,0.28000000000000003,0.3,0.32,0.3,"ET Based on NRCS state office Aug,2000 (planting 6/15 and harvesting 9/30)"]
[27,"Lettuce (Fall Planting)",6,8,10,10,7,10,6,8,11,9,11,10,8,11,11,12,12,14,"ET Based on NRCS state office Aug,2000 (planting 8/31 and harvesting 12/31)",null,null,null,null,null,null,null,null,null,null,null,null,null,null,null,null,null,null,null,null,null,null,null,null,null,null,null,null,null,null,null,27,"Lettuce (Fall Planting)",0.08,0.1,0.12,0.11,0.1,0.11,0.09,0.11,0.13,0.11,0.11,0.12,0.11,0.17,0.17,0.19,0.15,0.17,"ET Based on NRCS state office Aug,2000 (planting 8/31 and harvesting 12/31)"]
[28,"Lettuce (Spring Planting)",13,15,17,17,17,18,17,19,19,19,19,21,21,22,23,24,25,27,"ET Based on NRCS state office Aug,2000 (planting 3/15 and harvesting 7/15)",null,null,null,null,null,null,null,null,null,null,null,null,null,null,null,null,null,null,null,null,null,null,null,null,null,null,null,null,null,null,null,28,"Lettuce (Spring Planting)",0.13,0.15,0.17,0.16,0.18,0.18,0.21,0.21,0.21,0.23,0.23,0.22,0.26,0.24,0.24,0.26,0.28000000000000003,0.28000000000000003,"ET Based on NRCS state office Aug,2000 (planting 3/15 and harvesting 7/15)"]
[29,"Melon (planting 3/16)",15,17,19,19,20,21,22,23,23,24,24,26,26,27,28,30,30,31,"ET Based on NRCS state office Aug,2000 (planting 3/16 and harvesting 7/31)",null,null,null,null,null,null,null,null,null,null,null,null,null,null,null,null,null,null,null,null,null,null,null,null,null,null,null,null,null,null,null,29,"Melon (planting 3/16)",0.14000000000000001,0.17,0.19,0.18,0.2,0.2,0.23,0.23,0.23,0.25,0.25,0.25,0.28000000000000003,0.27,0.27,0.28999999999999998,0.31,0.31,"ET Based on NRCS state office Aug,2000 (planting 3/16 and harvesting 7/31)"]
[30,"Melon (planting 4/1)",24,27,31,31,32,34,34,36,38,37,39,39,41,42,43,46,48,50,"ET Based on NRCS state office Aug,2000 (planting 4/1 and harvesting 1/15)",null,null,null,null,null,null,null,null,null,null,null,null,null,null,null,null,null,null,null,null,null,null,null,null,null,null,null,null,null,null,null,30,"Melon (planting 4/1)",0.14000000000000001,0.15,0.17,0.18,0.2,0.2,0.23,0.23,0.23,0.25,0.25,0.24,0.28000000000000003,0.27,0.27,0.28999999999999998,0.31,0.28999999999999998,"ET Based on NRCS state office Aug,2000 (planting 4/1 and harvesting 1/15)"]
[31,"Millet",10,13,16,16,13,16,11,15,18,14,15,16,15,17,17,19,20,24,"ET Based on NRCS state office Aug,2000 (planting 11/1 and harvesting 5/31)",null,null,null,null,null,null,null,null,null,null,null,null,null,null,null,null,null,null,null,null,null,null,null,null,null,null,null,null,null,null,null,31,"Millet",0.1,0.12,0.15,0.14000000000000001,0.13,0.15,0.12,0.15,0.16,0.14000000000000001,0.14000000000000001,0.16,0.15,0.16,0.17,0.18,0.19,0.22,"ET Based on NRCS state office Aug,2000 (planting 11/1 and harvesting 5/31)"]
[32,"Oats",11,14,17,16,14,17,12,15,19,14,16,16,16,18,18,19,21,25,"ET Based on NRCS state office Aug,2000 (planting 11/1 and harvesting 5/31)",null,null,null,null,null,null,null,null,null,null,null,null,null,null,null,null,null,null,null,null,null,null,null,null,null,null,null,null,null,null,null,32,"Oats",0.12,0.14000000000000001,0.17,0.16,0.15,0.17,0.14000000000000001,0.17,0.19,0.16,0.16,0.18,0.17,0.18,0.2,0.2,0.22,0.25,"ET Based on NRCS state office Aug,2000 (planting 11/1 and harvesting 5/31)"]
[33,"Olives",23,27,33,33,31,35,31,35,39,35,37,37,38,40,41,44,47,50,"ET Based on NRCS state office Aug,2000 (planting 1/1 and harvesting 12/31)",null,null,null,null,null,null,null,null,null,null,null,null,null,null,null,null,null,null,null,null,null,null,null,null,null,null,null,null,null,null,null,33,"Olives",0.11,0.12,0.14000000000000001,0.13,0.15,0.15,0.17,0.17,0.17,0.19,0.19,0.18,0.21,0.2,0.2,0.21,0.23,0.23,"ET Based on NRCS state office Aug,2000 (planting 1/1 and harvesting 12/31)"]
[34,"Onion (dry) (Fall Planting)",15,19,24,23,19,24,17,22,27,20,23,23,23,25,26,28,30,34,"ET Based on NRCS state office Aug,2000 (planting 9/16 and harvesting 5/31)",null,null,null,null,null,null,null,null,null,null,null,null,null,null,null,null,null,null,null,null,null,null,null,null,null,null,null,null,null,null,null,34,"Onion (dry) (Fall Planting)",0.13,0.15,0.17,0.16,0.18,0.18,0.2,0.2,0.19,0.21,0.21,0.22,0.24,0.23,0.23,0.25,0.26,0.28000000000000003,"ET Based on NRCS state office Aug,2000 (planting 9/16 and harvesting 5/31)"]
[35,"Onion (dry) (Spring Planting)",20,23,26,26,27,28,28,31,31,31,32,33,34,35,36,38,40,42,"ET Based on NRCS state office Aug,2000 (planting 3/1 and harvesting 8/31)",null,null,null,null,null,null,null,null,null,null,null,null,null,null,null,null,null,null,null,null,null,null,null,null,null,null,null,null,null,null,null,35,"Onion (dry) (Spring Planting)",0.14000000000000001,0.16,0.18,0.17,0.19,0.19,0.23,0.22,0.22,0.24,0.24,0.24,0.27,0.26,0.26,0.28000000000000003,0.3,0.3,"ET Based on NRCS state office Aug,2000 (planting 3/1 and harvesting 8/31)"]
[36,"Onion (green)",16,18,21,21,21,22,22,24,25,25,25,26,27,27,29,30,32,34,"ET Based on NRCS state office Aug,2000 (planting 3/1 and harvesting 8/31)",null,null,null,null,null,null,null,null,null,null,null,null,null,null,null,null,null,null,null,null,null,null,null,null,null,null,null,null,null,null,null,36,"Onion (green)",0.13,0.15,0.17,0.17,0.19,0.19,0.22,0.22,0.22,0.23,0.24,0.23,0.26,0.25,0.25,0.27,0.28999999999999998,0.28999999999999998,"ET Based on NRCS state office Aug,2000 (planting 3/1 and harvesting 8/31)"]
[37,"Pasture",33,39,46,47,44,50,44,50,55,49,53,53,55,57,58,63,67,72,"ET Based on NRCS state office Aug,2000 (planting 1/1 and harvesting 12/31)",null,null,null,null,null,null,null,null,null,null,null,null,null,null,null,null,null,null,null,null,null,null,null,null,null,null,null,null,null,null,null,37,"Pasture",0.15,0.18,0.19,0.19,0.21,0.21,0.25,0.25,0.25,0.27,0.27,0.24,0.3,0.28999999999999998,0.28999999999999998,0.31,0.28000000000000003,0.33,"ET Based on NRCS state office Aug,2000 (planting 1/1 and harvesting 12/31)"]
[38,"Peas",7,9,10,10,10,10,9,11,11,10,10,12,11,12,13,13,14,16,"ET Based on NRCS state office Aug,2000 (planting 3/1 and harvesting 5/31)",null,null,null,null,null,null,null,null,null,null,null,null,null,null,null,null,null,null,null,null,null,null,null,null,null,null,null,null,null,null,null,38,"Peas",0.14000000000000001,0.16,0.18,0.18,0.19,0.19,0.19,0.21,0.2,0.21,0.21,0.24,0.23,0.24,0.25,0.27,0.28000000000000003,0.3,"ET Based on NRCS state office Aug,2000 (planting 3/1 and harvesting 5/31)"]
[39,"Peppers",20,23,27,26,27,29,28,31,32,32,32,34,35,35,36,39,41,43,"ET Based on NRCS state office Aug,2000 (planting 3/1 and harvesting 8/31)",null,null,null,null,null,null,null,null,null,null,null,null,null,null,null,null,null,null,null,null,null,null,null,null,null,null,null,null,null,null,null,39,"Peppers",0.14000000000000001,0.16,0.18,0.17,0.19,0.19,0.23,0.23,0.23,0.25,0.25,0.24,0.28000000000000003,0.27,0.26,0.28000000000000003,0.3,0.3,"ET Based on NRCS state office Aug,2000 (planting 3/1 and harvesting 8/31)"]
[40,"Pistachios",27,31,35,36,37,38,38,41,43,42,43,44,46,47,48,51,54,56,"ET Estimated based on Westland's data and NRCS Aug,2000 data (added 2\" to NRCS almonds data)",null,null,null,null,null,null,null,null,null,null,null,null,null,null,null,null,null,null,null,null,null,null,null,null,null,null,null,null,null,null,null,40,"Pistachios",0.15,0.17,0.18,0.18,0.2,0.2,0.23,0.24,0.25,0.26,0.26,0.27,0.28000000000000003,0.28999999999999998,0.3,0.31,0.33,0.33,"ET Estimated based on Westland's data and NRCS Aug,2000 data (added 2\" to NRCS almonds data)"]
[41,"Pomegranates",18,22,26,27,28,29,29,32,34,33,34,35,37,38,39,42,45,47,"ET Esimated based on Annexure-11 www.cgg.gov.in/ipmip website and assumed zone 14 was correlated",null,null,null,null,null,null,null,null,null,null,null,null,null,null,null,null,null,null,null,null,null,null,null,null,null,null,null,null,null,null,null,41,"Pomegranates",0.13,0.15,0.17,0.17,0.19,0.19,0.21,0.22,0.23,0.24,0.24,0.25,0.25,0.26,0.26,0.27,0.28999999999999998,0.28999999999999998,"ET Esimated based on Annexure-11 www.cgg.gov.in/ipmip website and assumed zone 14 was correlated"]
[42,"Potato (planting 3/1)",11,13,15,15,14,16,13,16,17,17,17,19,16,19,20,21,21,24,"ET Based on NRCS state office Aug,2000 (planting 3/1 and harvesting 6/30)",null,null,null,null,null,null,null,null,null,null,null,null,null,null,null,null,null,null,null,null,null,null,null,null,null,null,null,null,null,null,null,42,"Potato (planting 3/1)",0.12,0.14000000000000001,0.18,0.15,0.17,0.17,0.17,0.19,0.18,0.25,0.19,0.21,0.21,0.21,0.22,0.23,0.24,0.3,"ET Based on NRCS state office Aug,2000 (planting 3/1 and harvesting 6/30)"]
[43,"Potato (planting 4/30)",17,19,21,22,23,24,25,26,26,27,28,28,30,30,31,33,34,35,"ET Based on NRCS state office Aug,2000 (planting 4/30 and harvesting 9/30)",null,null,null,null,null,null,null,null,null,null,null,null,null,null,null,null,null,null,null,null,null,null,null,null,null,null,null,null,null,null,null,43,"Potato (planting 4/30)",0.13,0.14000000000000001,0.16,0.16,0.18,0.18,0.21,0.21,0.21,0.23,0.23,0.22,0.26,0.25,0.24,0.26,0.28000000000000003,0.27,"ET Based on NRCS state office Aug,2000 (planting 4/30 and harvesting 9/30)"]
[44,"Radishes",2,3,3,3,3,3,3,4,4,3,3,4,4,4,4,4,5,5,"ET Based on NRCS state office Aug,2000 (planting 4/1 and harvesting 5/1)",null,null,null,null,null,null,null,null,null,null,null,null,null,null,null,null,null,null,null,null,null,null,null,null,null,null,null,null,null,null,null,44,"Radishes",0.09,0.11,0.12,0.12,0.12,0.13,0.11,0.13,0.13,0.13,0.13,0.15,0.14000000000000001,0.15,0.16,0.16,0.17,0.19,"ET Based on NRCS state office Aug,2000 (planting 4/1 and harvesting 5/1)"]
[45,"Rice",22,25,29,29,30,31,32,34,34,36,37,37,39,40,40,43,45,47,"ET Based on NRCS state office Aug,2000 (planting 5/1 and harvesting 9/30)",null,null,null,null,null,null,null,null,null,null,null,null,null,null,null,null,null,null,null,null,null,null,null,null,null,null,null,null,null,null,null,45,"Rice",0.17,0.19,0.21,0.21,0.23,0.23,0.28000000000000003,0.27,0.27,0.3,0.28999999999999998,0.28999999999999998,0.33,0.32,0.32,0.34,0.36,0.36,"ET Based on NRCS state office Aug,2000 (planting 5/1 and harvesting 9/30)"]
[46,"Safflower",12,14,16,16,17,18,18,20,19,20,20,21,22,22,23,24,26,27,"ET Based on NRCS state office Aug,2000 (planting 4/1 and harvesting 7/31)",null,null,null,null,null,null,null,null,null,null,null,null,null,null,null,null,null,null,null,null,null,null,null,null,null,null,null,null,null,null,null,46,"Safflower",0.17,0.19,0.21,0.21,0.23,0.23,0.26,0.27,0.26,0.28999999999999998,0.28000000000000003,0.28999999999999998,0.32,0.31,0.31,0.33,0.35,0.36,"ET Based on NRCS state office Aug,2000 (planting 4/1 and harvesting 7/31)"]
[47,"Sorghum (planting 7/1)",10,12,13,14,14,15,15,16,17,16,18,17,18,18,18,20,21,21,"ET Based on NRCS state office Aug,2000 (planting 7/1 and harvesting 10/31)",null,null,null,null,null,null,null,null,null,null,null,null,null,null,null,null,null,null,null,null,null,null,null,null,null,null,null,null,null,null,null,47,"Sorghum (planting 7/1)",0.14000000000000001,0.16,0.18,0.19,0.2,0.21,0.22,0.22,0.23,0.24,0.25,0.24,0.26,0.26,0.26,0.28000000000000003,0.28999999999999998,0.3,"ET Based on NRCS state office Aug,2000 (planting 7/1 and harvesting 10/31)"]
[48,"Sorghum (planting 3/31)",16,19,21,21,23,23,24,26,26,27,27,28,30,30,30,32,34,35,"ET Based on NRCS state office Aug,2000 (planting 3/31 and harvesting 8/31)",null,null,null,null,null,null,null,null,null,null,null,null,null,null,null,null,null,null,null,null,null,null,null,null,null,null,null,null,null,null,null,48,"Sorghum (planting 3/31)",0.17,0.19,0.21,0.21,0.23,0.23,0.28000000000000003,0.27,0.27,0.3,0.28999999999999998,0.28999999999999998,0.33,0.32,0.32,0.34,0.36,0.36,"ET Based on NRCS state office Aug,2000 (planting 3/31 and harvesting 8/31)"]
[49,"Spinach",2,3,4,4,2,4,2,3,5,2,4,3,3,4,3,4,4,5,"ET Based on NRCS state office Aug,2000 (planting 11/15 and harvesting 1/31)",null,null,null,null,null,null,null,null,null,null,null,null,null,null,null,null,null,null,null,null,null,null,null,null,null,null,null,null,null,null,null,49,"Spinach",0.04,0.05,0.06,0.06,0.04,0.06,0.03,0.05,0.08,0.04,0.06,0.05,0.05,0.06,0.06,0.06,7.0000000000000007E-2,0.09,"ET Based on NRCS state office Aug,2000 (planting 11/15 and harvesting 1/31)"]
[50,"Squash",4,5,7,6,5,7,5,6,8,7,9,8,6,9,9,10,8,10,"ET Based on NRCS state office Aug,2000 (planting 8/31 and harvesting 12/31)",null,null,null,null,null,null,null,null,null,null,null,null,null,null,null,null,null,null,null,null,null,null,null,null,null,null,null,null,null,null,null,50,"Squash",0.09,0.1,0.12,0.11,0.11,0.12,0.09,0.13,0.13,0.12,0.12,0.14000000000000001,0.13,0.14000000000000001,0.15,0.15,0.16,0.18,"ET Based on NRCS state office Aug,2000 (planting 8/31 and harvesting 12/31)"]
[51,"Stone fruits",25,29,33,34,35,36,36,39,41,40,41,42,44,45,46,49,52,54,"ET Based on NRCS state office Aug,2000 (planting 3/1 and harvesting 10/15)",null,null,null,null,null,null,null,null,null,null,null,null,null,null,null,null,null,null,null,null,null,null,null,null,null,null,null,null,null,null,null,51,"Stone fruits",0.16,0.18,0.2,0.2,0.22,0.22,0.26,0.26,0.26,0.28000000000000003,0.28000000000000003,0.27,0.32,0.3,0.3,0.32,0.35,0.34,"ET Based on NRCS state office Aug,2000 (planting 3/1 and harvesting 10/15)"]
[52,"Strawberries",11,13,14,15,15,16,17,17,18,18,19,19,20,20,20,22,23,23,"ET Based on NRCS state office Aug,2000 (planting 5/1 and harvesting 9/30)",null,null,null,null,null,null,null,null,null,null,null,null,null,null,null,null,null,null,null,null,null,null,null,null,null,null,null,null,null,null,null,52,"Strawberries",0.11,0.11,0.13,0.13,0.15,0.15,0.17,0.17,0.17,0.19,0.19,0.18,0.21,0.2,0.2,0.21,0.23,0.22,"ET Based on NRCS state office Aug,2000 (planting 5/1 and harvesting 9/30)"]
[53,"Sugarbeets (planting 6/3)",16,20,25,25,20,26,19,23,29,22,25,24,24,27,27,29,32,36,"ET Based on NRCS state office Aug,2000 (planting 6/3 and harvesting 4/30)",null,null,null,null,null,null,null,null,null,null,null,null,null,null,null,null,null,null,null,null,null,null,null,null,null,null,null,null,null,null,null,53,"Sugarbeets (planting 6/16)",0.09,0.1,0.12,0.12,0.12,0.13,0.12,0.13,0.15,0.13,0.14000000000000001,0.14000000000000001,0.14000000000000001,0.2,0.2,0.16,0.17,0.18,"ET Based on NRCS state office Aug,2000 (planting 6/3 and harvesting 4/30)"]
[54,"Sugarbeets (planting 3/16)",20,23,26,26,28,29,30,32,32,33,34,34,36,36,37,40,42,43,"ET Based on NRCS state office Aug,2000 (planting 3/16 and harvesting 9/15)",null,null,null,null,null,null,null,null,null,null,null,null,null,null,null,null,null,null,null,null,null,null,null,null,null,null,null,null,null,null,null,54,"Sugarbeets (planting 3/16)",0.17,0.19,0.21,0.21,0.23,0.23,0.28000000000000003,0.27,0.27,0.3,0.28999999999999998,0.28999999999999998,0.33,0.32,0.32,0.34,0.36,0.36,"ET Based on NRCS state office Aug,2000 (planting 3/16 and harvesting 9/15)"]
[55,"Sunflower",14,15,17,18,19,20,21,22,22,23,24,24,26,25,26,27,29,29,"ET Based on NRCS state office Aug,2000 (planting 5/1 and harvesting 9/10)",null,null,null,null,null,null,null,null,null,null,null,null,null,null,null,null,null,null,null,null,null,null,null,null,null,null,null,null,null,null,null,55,"Sunflower",0.17,0.18,0.21,0.21,0.23,0.23,0.28000000000000003,0.27,0.27,0.3,0.28999999999999998,0.28999999999999998,0.33,0.32,0.32,0.34,0.36,0.35,"ET Based on NRCS state office Aug,2000 (planting 5/1 and harvesting 9/10)"]
[56,"Tomato (planting 1/31)",14,16,19,18,18,19,17,21,21,20,20,22,22,23,24,25,27,30,"ET Based on NRCS state office Aug,2000 (planting 1/31 and harvesting 6/30)",null,null,null,null,null,null,null,null,null,null,null,null,null,null,null,null,null,null,null,null,null,null,null,null,null,null,null,null,null,null,null,56,"Tomato (planting 1/31)",0.16,0.19,0.21,0.21,0.22,0.22,0.22,0.25,0.24,0.25,0.25,0.28000000000000003,0.27,0.28000000000000003,0.28999999999999998,0.31,0.32,0.35,"ET Based on NRCS state office Aug,2000 (planting 1/31 and harvesting 6/30)"]
[57,"Tomato (planting 4/2)",14,16,18,18,20,20,21,22,22,29,29,29,25,31,32,34,29,31,"ET Based on NRCS state office Aug,2000 (planting 4/2 and harvesting 9/8)",null,null,null,null,null,null,null,null,null,null,null,null,null,null,null,null,null,null,null,null,null,null,null,null,null,null,null,null,null,null,null,57,"Tomato (planting 4/2)",0.17,0.2,0.22,0.22,0.24,0.24,0.28999999999999998,0.25,0.28000000000000003,0.31,0.31,0.3,0.35,0.33,0.33,0.35,0.38,0.37,"ET Based on NRCS state office Aug,2000 (planting 4/2 and harvesting 9/8)"]
[58,"Turfgrass",20,24,28,28,26,30,26,30,33,30,32,32,33,34,35,38,40,43,"ET Based on NRCS state office Aug,2000 (Warm Season) (planting 1/1 and harvesting 12/31)",null,null,null,null,null,null,null,null,null,null,null,null,null,null,null,null,null,null,null,null,null,null,null,null,null,null,null,null,null,null,null,58,"Turfgrass",0.15,0.17,0.19,0.19,0.21,0.21,0.24,0.23,0.23,0.25,0.25,0.25,0.28000000000000003,0.27,0.27,0.28999999999999998,0.31,0.32,"ET Based on NRCS state office Aug,2000 (Warm Season) (planting 1/1 and harvesting 12/31)"]
[59,"Walnuts",24,28,32,32,33,35,34,37,39,38,40,40,42,43,44,47,49,51,"ET Based on NRCS state office Aug,2000 (planting 4/1 and harvesting 11/15)",null,null,null,null,null,null,null,null,null,null,null,null,null,null,null,null,null,null,null,null,null,null,null,null,null,null,null,null,null,null,null,59,"Walnuts",0.15,0.16,0.19,0.2,0.21,0.22,0.25,0.25,0.25,0.27,0.27,0.26,0.3,0.28999999999999998,0.28999999999999998,0.31,0.33,0.32,"ET Based on NRCS state office Aug,2000 (planting 4/1 and harvesting 11/15)"]
[60,"Wheat (planting 10/14)",12,14,18,18,14,18,13,16,20,15,17,17,17,19,19,21,23,26,"ET Based on NRCS state office Aug,2000 (planting 10/14 and harvesting 6/2)",null,null,null,null,null,null,null,null,null,null,null,null,null,null,null,null,null,null,null,null,null,null,null,null,null,null,null,null,null,null,null,60,"Wheat (planting 10/14)",0.12,0.14000000000000001,0.17,0.16,0.14000000000000001,0.17,0.13,0.17,0.18,0.15,0.15,0.17,0.16,0.18,0.19,0.2,0.21,0.24,"ET Based on NRCS state office Aug,2000 (planting 10/14 and harvesting 6/2)"]
[61,"Wheat (planting 11/15)",13,18,22,21,19,22,18,22,25,21,22,24,23,25,26,27,30,33,"ET Based on NRCS state office Aug,2000 (planting 11/15 and harvesting 7/4)",null,null,null,null,null,null,null,null,null,null,null,null,null,null,null,null,null,null,null,null,null,null,null,null,null,null,null,null,null,null,null,61,"Wheat (planting 11/15)",0.14000000000000001,0.17,0.19,0.19,0.19,0.2,0.18,0.22,0.21,0.21,0.21,0.24,0.23,0.24,0.26,0.27,0.28000000000000003,0.31,"ET Based on NRCS state office Aug,2000 (planting 11/15 and harvesting 7/4)"]
[62,null,null,null,null,null,null,null,null,null,null,null,null,null,null,null,null,null,null,null,null,null,null,null,null,null,null,null,null,null,null,null,null,null,null,null,null,null,null,null,null,null,null,null,null,null,null,null,null,null,null,null,62]
[63,null,null,null,null,null,null,null,null,null,null,null,null,null,null,null,null,null,null,null,null,null,null,null,null,null,null,null,null,null,null,null,null,null,null,null,null,null,null,null,null,null,null,null,null,null,null,null,null,null,null,null,63]
[]
[null,null,"Before Efficiencies",null,null,null,null,null,null,null,null,null,"After Efficiencies"]
[null,null,1,2,3,4,5,6,7,8,9,null,1,2,3,4,5,6,7,8,9]
[null,null,"s","ls","sl","fsl","l","si","cl","c","organic",null,"s","ls","sl","fsl","l","sil","cl","c","organic"]
[1,"SURFACE IRRIGATION (Under optimal conditions (lined ditch, tailwater recovery, good DU)) (No change) ",{"$f":"M72","v":60},{"$f":"N72","v":65},70,74,78,78,78,78,65,null,60,65,70,74,78,78,78,78,65]
[{"$f":"A72+1","v":2},"SURFACE IRRIGATION (Replace Unlined ditch with Pipeline/lining) ",45,52,59,67,71,73,75,75,52,null,60,65,70,74,78,78,78,78,65]
[{"$f":"A73+1","v":3},"SURFACE IRRIGATION (Replace a leaky pipeline with a pipeline)",50,55,61,68,72,74,76,76,55,null,60,65,70,74,78,78,78,78,65]
[4,"SURFACE IRRIGATION (Improve DU (Split runs, higher Q, etc.)",43,48,54,58,64,64,64,64,48,null,60,65,70,74,78,78,78,78,65]
[5,"SURFACE IRRIGATION (Install a tailwater recovery system)",53,56,58,60,61,61,61,61,56,null,60,65,70,74,78,78,78,78,65]
[6,"SURFACE IRRIGATION (Landleveling (previously leveled)",54,58.5,63,66.5,70,70,70,70,59,null,60,65,70,74,78,78,78,78,65]
[7,"SURFACE IRRIGATION (Landleveling (previously unleveled)",48,52,56,59,62,62,62,62,52,null,60,65,70,74,78,78,78,78,65]
[8,"SPRINKLER IRR. (Hand Move/Side Roll) (No change)",73,73,73,73,73,73,73,73,73,null,73,73,73,73,73,73,73,73,73]
[9,"SPRINKLER IRR. (Hand Move/Side Roll) (Replace Surface irrigation)",43,48,54,56,61,61,62,62,48,null,73,73,73,73,73,73,73,73,73]
[10,"SPRINKLER IRR. (Solid Set, Undertree) (No change)",80,80,80,80,80,80,80,80,80,null,80,80,80,80,80,80,80,80,80]
[11,"SPRINKLER IRR. (Solid Set, Undertree) (Replace surface irrigation)",43,48,54,56,61,61,62,62,48,null,80,80,80,80,80,80,80,80,80]
[12,"SPRINKLER IRR. (Solid Set, Undertree)(Replace hand move sprinkler)",73,73,73,73,73,73,73,73,73,null,80,80,80,80,80,80,80,80,80]
[13,"DRIP IRRIGATION (No change)",85,85,85,85,85,85,85,85,85,null,85,85,85,85,85,85,85,85,85]
[14,"DRIP IRRIGATION (Replace surface irrigation)",43,48,54,56,61,61,62,62,48,null,85,85,85,85,85,85,85,85,85]
[15,"DRIP IRRIGATION (Replace under tree, solid set sprinkler or drip)",80,80,80,80,80,80,80,80,80,null,85,85,85,85,85,85,85,85,85]
[16,"DRIP IRRIGATION (Replace hand move sprinkler)",73,73,73,73,73,73,73,73,73,null,85,85,85,85,85,85,85,85,85]
[17,"CENTER PIVOTS (No change)",80,80,80,80,80,80,80,80,80,null,80,80,80,80,80,80,80,80,80]
[18,"CENTER PIVOTS (Replace suface irrigation)",43,48,54,56,61,61,62,62,48,null,80,80,80,80,80,80,80,80,80]
[19,"CENTER PIVOTS (Replace wheel lines)",73,73,73,73,73,73,73,73,73,null,80,80,80,80,80,80,80,80,80]
[20,"OTHER"]
[]
[]
["No Change in IWM plan",null,"Soil"]
["Increase IWM by 1 Level",null,"Sand"]
["Increase IWM by 2 Levels",null,"Loamy Sand"]
["Increase IWM by 3 Levels",null,"Sandy Loam"]
[null,null,"Fine Sandy Loam"]
[null,null,"Loam"]
[null,null,"Silt"]
[null,null,"Clay Loam"]
[null,null,"Clay "]
[null,null,"Organic"]
[null,null,"used for pull down menu"]
[]
[]
[]
[]
[]
[null,null,"Baseline-select","T-select","R-select",null,null,"ET Zone ",1,{"$f":"I110+1","v":2},{"$f":"J110+1","v":3},4,5,6,7,8,9,10,11,12,13,14,15,16,17,18]
["Selection",null,2,71,42,null,null,{"$f":"1*I111+2*J111+3*K111+4*L111+5*M111+6*N111+7*O111+8*P111+9*Q111+10*R111+11*S111+12*T111+13*U111+14*V111+15*W111+16*X111+17*Y111+18*Z111","v":16},{"$f":"SUM(I127:J132,J133:J144,K132:K137,I138:I139,K140:K142,I142:I146,H144:H148,G147,H148:I149,J149:J150,K150:K151,L151:L152,M152:M155,M157:M159,N156:N163,O162:O165,P164:P166,Q166:Q167,R167:R168,S168:S170,T170:T171,U171:U173,V173:V174,W174:X175,Z174:Z175,Y176:Y183,Z182:Z185,AA184:AA185,I112)","v":0},{"$f":"SUM(Z172:Z173,Z176:Z178,AD186,AE185:AE190,AC190:AD190,AF186:AF190,AG187:AG189,AH187:AH188,AI187,BK222:BN223,BO224,BP225:BQ225)","v":0},{"$f":"SUM(K127:K131,L127:L150,M127:M143,N127:N134,K138:K139,K143:K149,J145:J148,I147,M148:M151,N151:N153,O152:O153,Z179:Z181,AA181:AA183,AB182:AB184,AC183:AC185,AD183:AD185,AE184,AP206:AQ206,AQ207:AR208,AR209:AR214,BB216,BC217:BC218,BD218:BF218,BF219:BI219)","v":0},{"$f":"SUM(N154:P155,O156:P161,P162:Q163,Q158:Q161,R163:R166,Q164:Q165,S165:S167,T167:T169,U168:U170,V171:V172,Y173:Y175,AS214:AZ214,AW215:BB215,BC216,BD217:BE217,BG218:BH218,BJ219:BJ220,BL220:BO220,BM221:BO221,BO222:BO223,BP223:BP224,BR225:BS226,BS227:BU227,BT226,BT228:BV228,BU229:BV230,BW230:BW233,BV231:BV232,BX236:BX237)","v":0},{"$f":"SUM(V168:V170,W169:W173,X171:Y172,X173,Z170)","v":0},{"$f":"SUM(AA176:AC178,AB179:AC179,AB180,AE191:AI192,AG190:AH190,AH189,AF193:AI193,AG194:AJ195,AK195,AH196:AK196,AI197:AL197,AJ198:AL198,AK199:AM199,AL200:AN201,AM202:AO202,AN203:AP203,AO204:AP204,AP205:AR205,AR206:AS206,AS207:AS213,AT209:AT213,AU210:AU213,AV212:AV213,N112)","v":0},{"$f":"SUM(AB129:AB131,AC127:AV132,AD133:AV133,AE134:AV135,AF136:AV137,AG138:AV138,AH139:AV139,AI140:AV140,AJ141:AV141,AK142:AV142,AL143:AV143,AO144:AS144,AU144:AV144)","v":0},{"$f":"SUM(Q155:Q157,R156:R162,S157:S164,T158:T166,U159:U167,V160:V167,W161:Y168,Z162:Z169,X169:Y170,AA164:AA175,AB166:AB175,AC170:AC175,AD171:AD174,Z171,AA179:AA180,AD176:AD182,AC180:AC182,AB181,AE181:AE183,AF183:AF185,AG184:AG186,AH185:AH186,AI186:AJ186)","v":0},{"$f":"SUM(BC215:BG215,BD216:BK216,BF217:BM217,BI218:BW218,BO219:BY219,BW220:BY220,BX221:BY221,BY222,BZ222:BZ237,CA223:CA228,CB224:CB226,BY227:BY232,BX227:BX229,CA232:CA237)","v":0},{"$f":"SUM(U127:AB127,V128:AB128,V129:AA129,W130:AA131,X132:AB133,AC133,Y134:AD135,Z136:AE139,AF138:AF139,AG139,Y140:AH140,Y141:AI141,Y142:AJ142,Y143:Z143,AC143:AG143,AC144:AD144,AJ143:AK143,AI188:AI190,AJ187:AL192,AL193,AM188:AM195,AN189:AN196,AO190:AO198,AP191:AP199,AQ192:AQ201,AR193:AR204,AQ203:AQ204,AS196:AS205,AT198:AT208,R112)","v":0},{"$f":"SUM(AV163,AW164,AV165:AX165,AS166:AZ166,AQ167:BA167,AP168:BB168,AP169:BC169,AO170:BE170,AN171:BF171,AO172:BF172,AP173:BC173,AQ174:BB174,AR175:BB175,AS176:BB177,AT178:BA179,AU180:AZ180,AV181:AX181,AW182)","v":0},{"$f":"SUM(AD152,AB153:AE153,AA154:AF157,AG155:AG157,AA158:AE158,AA159:AC159,AB160:AC162,AD162:AG162,AC163:AH163,AC164:AG164,AE165,AJ193:AK193,AK194,AL194:AL196,AM196:AM197,AL171:AM171,AH172:AN173,AO173,AI174:AP174,AJ175:AQ176,AK177:AQ178,AM179:AQ179,AR176:AR183,AS178:AS185,AP180:AQ181,AQ182,AT180:AT186,AU181:AU186,AV182:AV187,T112)","v":0},{"$f":"SUM(O127:T146,N135:N150,M144:M147,U128:U146,V130:V145,W132:W144,X134:X143,Y136:Y139,O147:T151,P152:V153,U149:U151,V151,Q154:W154,R155:W155,S156:W156,T157:W157,U158:W158,V159:W159,W160:X160,AH143:AI143,AE144:AN144,AT144,AC145:AV148,AD149:AV150,AE151:AV152,AF153:AV153,AG154:AV154,AH155:AV156,AH157,U112)","v":0},{"$f":"SUM(U147:U148,V146:V150,W145:W153,X144:Z159,AA143:AB152,AA153,AC149:AC152,AD151,Y160:AA160,Z161:AA161,AD159:AE161,AF158:AH161,AH162,AI157:AI171,AJ159:AJ171,AK161:AK171,AL163:AL170,AM165:AM170,AA162:AA163,AB163:AB165,AC165:AD169,AH164:AH171,AE166:AG180,AF165:AG165,AD175,AH174:AH184,AF181:AG182,AG183,AI175:AI185,V112)","v":0},{"$f":"SUM(AK186,AL183:AL186,AM180:AM187,AN180:AN188,AO180:AO189,AP182:AP190,AQ183:AQ191,AR184:AR191,AS186:AS191,AT187:AT191,AU187:AU190,AV188,AW202,AX202:AX204,AY201:AY205,AZ200:AZ206,BA198:BB207,BC199:BD208,BE200:BF208,BG202:BG208,BH204:BH206,BH208)","v":0},{"$f":"SUM(AR192,AS192:AS195,AT192:AT197,AU191:AU200,AV189:AV201,AW189:AW201,AX190:AX201,AY191:AY200,AZ192:AZ199,BA195:BA197,AM198,AN197:AN199,AO199:AO201,AP200:AP202,AQ202,BZ220:CA221,CA222:CB222,CB221,CB223:CD223,CC224:CE224,CC225:CF225,CC226:CG226,CG227,CA229:CA231,CB227:CD237,CE230:CF237,CG234:CG237,CH236:CH237,CH223:CI223,X112)","v":1},{"$f":"SUM(BN195,BO194:BO197,BP196:BP214,BO202:BO214,BN203,BN207:BN213,BL208:BM212,BK209:BK212,BJ210:BJ211,BI210,BQ198:BQ214,BR198:BR215,BS201:BS203,BT200:BT203,BU198:BU202,BS206:BS215,BT207:BV215,BW208:BW215,BX208:BY209,BZ209:BZ210,CA208:CC210,CC211,CD210:CD211,CE211,CF210:CF212,CC199:CC201,CD200:CD201,CC191:CC192,CD192:CD195,Y112)","v":0},{"$f":"SUM(BS185,BT185:BT186,BU186:BU189,BV188:BV191,BW189:BW190,BX190:BY193,BY194:BY198,BZ192:BZ198,CA195:CA198,CB198:CB199,CB220:CC220,CC221:CE222,CF222,CE223:CG223,CF224:CH224,CG225:CJ225,CE227:CF229,CG228:CG233,CH226:CL235,CM227:CM236,CI236:CL236,CI237:CJ237,CN228:CO236,CP229:CP236,CQ230:CR236,CS231:CT236,CU232:CU234,CV233:CV234,CW234,Z112)","v":0}]
["Humboldt",1,null,null,null,null,null,null,{"$f":"SUM(AB185:AB186,AC186,AC191:AD193,AE193:AE194,AF194:AF195,AG196,AH197,AI198:AI199,AJ199:AJ201,AK200:AK202,AL202:AL203,AM203,AN204:AN206,AO205:AO208,AP207:AP210,AQ209:AQ213,AQ220:AU221,AZ229:BA229,BK220:BK221,BL221,BV233:BV235,BW234:BW235)","v":0},null,null,null,null,{"$f":"SUM(BK219:BN219,BP220:BV222,BQ223:BY224,BW221:BW222,BX222,BT225:BY225,BU226:BY226,BV227:BW227,BW228:BW229,BX230:BX235,BY233:BY237)","v":0},null,null,null,{"$f":"SUM(AU201:AU209,AV202:AV211,AW203:AW213,AX205:AX213,AY206:AY213,AZ207:AZ213,BA208:BB214,BC209:BC214)","v":0},null,{"$f":"SUM(AW183:AW188,AX184:AX189,AY185:AY190,AZ186:AZ191,BA187:BA194,BB187:BB197,BC189:BC198,BD190:BD198,BE191:BE199,BF193:BF199)","v":0},{"$f":"SUM(AJ157:AV158,AK159:AV160,AL161:AV162,AM163:AU163,AM164:AV164,AN165:AU165,AN166:AR166,AN167:AP167,AN168:AO169,AN170)","v":0},{"$f":"SUM(AJ177:AJ185,AK179:AK185,AL179:AL182,AX182:AX183,AY181:AY184,AZ181:AZ185,BA180:BA186,BB178:BB186,BC174:BC188,BD173:BD189,BE173:BE190,BF173:BF192,BG172:BG201,BH173:BH203,BI174:BJ209,BK176:BK208,BH207,BL177:BL207,BM178:BM207,BN179:BN194,BN196:BN202,BN204:BN206,BO198:BO201,BO180:BO193,BP180:BP195,BQ182:BR197,BS183:BT184,BU185,BS186:BS200,V113)","v":0},null,{"$f":"SUM(CL223:CR223,CI224:CS224,CK225:CT225,CM226:CU226,CN227:CV227,CP228:CV228,CQ229:CV229,CS230:CV230,CU231:CW231,CV232:CW232,CW233:CX233)","v":0},{"$f":"SUM(CE193:CE202,CF197:CF203,CG197:CG213,CH201,CH204:CI213,CJ208:CJ214,CK208:CK210,CL206:CL209,CM202:CM207,CN201:CN205,CO202:CO204,CP203,CK212:CK215,CL213:CL218,CM213:CM217,CN212:CN216,CO211:CO212,CP211,CT207:CU208,CS209:CV209,CQ210:CV211,CW211,CU212:CX213,CV214:CY214,CW215:CZ215,CX216:DA216,CY217:DA217,DA218,Y113)","v":0},{"$f":"SUM(CO221:CR221,CN222:CU222,CS223:CW223,CT224:CW224,CU225:CW225,CV226)","v":0}]
["Mt. Diablo",2,null,null,null,null,null,null,null,null,null,null,null,null,null,null,null,null,null,null,null,{"$f":"SUM(BV186:BW187,BW188:BX188,BX189:BY189,BZ190:CA191,CA192:CB194,CB191,CB195:CB197,CC193:CC198,CD196:CD199,CF193:CH196,CH197:CM200,CI201:CM201,CH202:CL203,CJ204:CL205,CJ206:CK207,CR205:CS208,CP204:CQ208,CO205:CO208,CN207:CN208,CM208,CM209:CR209,CL210:CP210,CK211:CN211,CL212:CM212,BT187:BT199,BU190:BU197,BS204:BS205,BT204:BT206,BU203:BU206,V114)","v":0},null,null,{"$f":"SUM(BY214:CC214,BY215:CE215,CC216:CH216,CD217:CJ217,CF218:CK218,CI221:CJ221,CG222:CM222,CJ223:CK223)","v":0}]
["San Bernadino",3,null,null,null,null,null,null,null,null,null,null,null,null,null,null,null,null,null,null,null,{"$f":"SUM(BV192:BV206,BW191:BW207,BX194:BX207,BY199:CA207,BZ208,CB200:CB207,CC202:CD207,CE203:CE210,CF204:CF209,CD208:CD209,BX210:BY210,BX211:CB211,BX212:CE212,BX213:CF213,CD214:CI214,CF215:CJ215,CI216:CK216,CK217,BX214:BX215,BD209:BH214,BI211:BI214,BH215:BQ215,BJ212:BJ214,BK213:BM214,BN214,BL216:CB216,BN217:CC217,BX218:CE218,BZ219:CL219,V115)","v":0}]
[null,null,null,null,null,null,null,null,null,null,null,null,null,null,null,null,null,null,null,null,null,{"$f":"SUM(,CD220:CL220,CF221:CH221,CK221:CL221,CM218:CM221,CN217:CN221,CO213:CT220,CP212:CT212,CU214:CU220,CV215:CV220,CW216:CW220,CX217:CX220,CY218:CZ218,CS221:CW221,CV222:CW222)","v":0}]
[]
["Drainage",{"$f":"SUM(AQ185,AP186:AR186,AO187:AR187,AP188:AR188,AQ189:AS189,AR190:AT190,AS191:AU191,AT192:AV192,AT193:AV193,AU194:AV194,AV195:AV196,BA188:BB188,BB189:BC189)","v":0},{"$f":"IF(B117=0,\"\",\"Drainage Issue\")","v":""}]
[]
["Count",null,"Humbolt","Mt. Diablo","San Bernadino",null,1,{"$f":"G119+1","v":2},{"$f":"H119+1","v":3},4,5,6,7,8,9,10,11,12,13,14,15,16,17,18,19,20,21,22,23,24,25,26,27,28,29,30,31,32,33,34,35,36,37,38,39,40,41,42,43,44,45,46,47,48,49,50,51,52,53,54,55,56,57,58,59,60,61,62,63,64,65,66,{"$f":"BT119+1","v":67},68,69,70,71,72,73,74,75,76,77,78,79,80,81,82,83,84,85,86,87,88,89,90,91,92,93,94,95,96,97,98,99]
[]
["Humbolt",null,null,null,null,null,"4W","3W","2W","1W","1E","2E","3E","4E","5E","6E","7E","8E","9E","10E"]
["Mt. Diablo",null,null,null,null,null,null,null,null,null,null,"19W","18W","17W","16W","15W","14W","13W","12W","11W","10W","9W","8W","7W","6W","5W","4W","3W","2W","1W","1E","2E","3E","4E","5E","6E","7E","8E","9E","10E","11E","12E","13E","14E","15E","16E","17E","18E","19E","20E","21E","22E","23E","24E","25E","26E","27E","28E","29E","30E","31E","32E","33E","34E","35E","36E","37E","38E","39E","40E","41E","42E","43E","44E","45E","46E","47E"]
["San Bernadino",null,null,null,null,null,null,null,null,null,null,null,null,null,null,null,null,null,null,null,null,null,null,null,null,null,null,null,null,null,null,null,null,null,null,null,null,null,null,null,null,"36W","35W","34W","33W","32W","31W","30W","29W","28W","27W","26W","25W","24W","23W","22W","21W","20W","19W","18W","17W","16W","15W","14W","13W","12W","11W","10W","9W","8W","7W","6W","5W","4W","3W","2W","1W","1E","2E","3E","4E","5E","6E","7E","8E","9E","10E","11E","12E","13E","14E","15E","16E","17E","18E","19E","20E","21E","22E","23E","24E","25E","26E","27E","28E"]
[]
["Lookup",null,null,null,null,null,{"$f":"IF($E$111=G119,1,0)","v":0},{"$f":"IF($E$111=H119,1,0)","v":0},0,0,0,0,0,0,0,0,0,0,0,0,0,0,0,0,0,0,0,0,0,0,0,0,0,0,0,0,0,0,0,0,0,0,0,0,0,0,0,1,0,0,0,0,0,0,0,0,0,0,0,0,0,0,0,0,0,0,0,0,0,0,0,{"$f":"IF($E$111=BT119,1,0)","v":0},0,0,0,0,0,0,0,0,0,0,0,0,0,0,0,0,0,0,0,0,0,0,0,0,0,0,0,0,0,0,0,0,0]
[null,"count"]
[{"$f":"IF($D$111=B127,1,0)","v":0},1,"20N","49N",null,null,{"$f":"MIN(G$125,$A127)","v":0},{"$f":"MIN(H$125,$A127)","v":0},0,0,0,0,0,0,0,0,0,0,0,0,0,0,0,{"$f":"MIN(X$125,$A127)","v":0},0,0,0,0,0,0,0,0,0,0,0,0,0,0,0,{"$f":"MIN(AN$125,$A127)","v":0},0,0,0,0,0,0,0,0,0,0,0,0,0,0,0,{"$f":"MIN(BD$125,$A127)","v":0},0,0,0,0,0,0,0,0,0,0,0,0,0,0,0,{"$f":"MIN(BT$125,$A127)","v":0},0,0,0,0,0,0,0,0,0,0,0,0,0,0,0,{"$f":"MIN(CJ$125,$A127)","v":0},0,0,0,0,0,0,0,0,0,0,0,0,0,0,0,{"$f":"MIN(CZ$125,$A127)","v":0},0,null,null,null,null,null,null,null,null,null,null,null,null,null,null,null,null,null,"Township selection pulldown",null,null,null,null,null,null,null,"Range Selection pulldown"]
[{"$f":"IF($D$111=B128,1,0)","v":0},{"$f":"B127+1","v":2},"19N","48N",null,null,0,0,0,0,0,0,0,0,0,0,0,0,0,0,0,0,0,0,0,0,0,0,0,0,0,0,0,0,0,0,0,0,0,0,0,0,0,0,0,0,0,0,0,0,0,0,0,0,0,0,0,0,0,0,0,0,0,0,0,0,0,0,0,0,0,0,0,0,0,0,0,0,0,0,0,0,0,0,0,0,0,0,0,0,0,0,0,0,0,0,0,0,0,0,0,0,0,0,0,null,null,null,null,null,null,null,null,null,null,null,null,null,null,null,null,null,{"$f":"IF($C$111=$B$112,C127,IF($C$111=$B$113,D127,IF($C$111=$B$114,E127,\"\")))","v":"49N"},null,null,null,null,null,null,null,{"$f":"IF($C$111=$B$112,G$121,IF($C$111=$B$113,G$122,IF($C$111=$B$114,G$123,\"\")))","v":0}]
[0,{"$f":"B128+1","v":3},"18N","47N",null,null,0,0,0,0,0,0,0,0,0,0,0,0,0,0,0,0,0,0,0,0,0,0,0,0,0,0,0,0,0,0,0,0,0,0,0,0,0,0,0,0,0,0,0,0,0,0,0,0,0,0,0,0,0,0,0,0,0,0,0,0,0,0,0,0,0,0,0,0,0,0,0,0,0,0,0,0,0,0,0,0,0,0,0,0,0,0,0,0,0,0,0,0,0,0,0,0,0,0,0,null,null,null,null,null,null,null,null,null,null,null,null,null,null,null,null,null,"48N",null,null,null,null,null,null,null,{"$f":"IF($C$111=$B$112,H$121,IF($C$111=$B$113,H$122,IF($C$111=$B$114,H$123,\"\")))","v":0}]
[0,4,"17N","46N",null,null,0,0,0,0,0,0,0,0,0,0,0,0,0,0,0,0,0,0,0,0,0,0,0,0,0,0,0,0,0,0,0,0,0,0,0,0,0,0,0,0,0,0,0,0,0,0,0,0,0,0,0,0,0,0,0,0,0,0,0,0,0,0,0,0,0,0,0,0,0,0,0,0,0,0,0,0,0,0,0,0,0,0,0,0,0,0,0,0,0,0,0,0,0,0,0,0,0,0,0,null,null,null,null,null,null,null,null,null,null,null,null,null,null,null,null,null,"47N",null,null,null,null,null,null,null,{"$f":"IF($C$111=$B$112,I$121,IF($C$111=$B$113,I$122,IF($C$111=$B$114,I$123,\"\")))","v":0}]
[0,5,"16N","45N",null,null,0,0,0,0,0,0,0,0,0,0,0,0,0,0,0,0,0,0,0,0,0,0,0,0,0,0,0,0,0,0,0,0,0,0,0,0,0,0,0,0,0,0,0,0,0,0,0,0,0,0,0,0,0,0,0,0,0,0,0,0,0,0,0,0,0,0,0,0,0,0,0,0,0,0,0,0,0,0,0,0,0,0,0,0,0,0,0,0,0,0,0,0,0,0,0,0,0,0,0,null,null,null,null,null,null,null,null,null,null,null,null,null,null,null,null,null,"46N",null,null,null,null,null,null,null,{"$f":"IF($C$111=$B$112,J$121,IF($C$111=$B$113,J$122,IF($C$111=$B$114,J$123,\"\")))","v":0}]
[0,6,"15N","44N",null,null,0,0,0,0,0,0,0,0,0,0,0,0,0,0,0,0,0,0,0,0,0,0,0,0,0,0,0,0,0,0,0,0,0,0,0,0,0,0,0,0,0,0,0,0,0,0,0,0,0,0,0,0,0,0,0,0,0,0,0,0,0,0,0,0,0,0,0,0,0,0,0,0,0,0,0,0,0,0,0,0,0,0,0,0,0,0,0,0,0,0,0,0,0,0,0,0,0,0,0,null,null,null,null,null,null,null,null,null,null,null,null,null,null,null,null,null,"45N",null,null,null,null,null,null,null,{"$f":"IF($C$111=$B$112,K$121,IF($C$111=$B$113,K$122,IF($C$111=$B$114,K$123,\"\")))","v":0}]
[0,7,"14N","43N",null,null,0,0,0,0,0,0,0,0,0,0,0,0,0,0,0,0,0,0,0,0,0,0,0,0,0,0,0,0,0,0,0,0,0,0,0,0,0,0,0,0,0,0,0,0,0,0,0,0,0,0,0,0,0,0,0,0,0,0,0,0,0,0,0,0,0,0,0,0,0,0,0,0,0,0,0,0,0,0,0,0,0,0,0,0,0,0,0,0,0,0,0,0,0,0,0,0,0,0,0,null,null,null,null,null,null,null,null,null,null,null,null,null,null,null,null,null,"44N",null,null,null,null,null,null,null,{"$f":"IF($C$111=$B$112,L$121,IF($C$111=$B$113,L$122,IF($C$111=$B$114,L$123,\"\")))","v":"19W"}]
[0,8,"13N","42N",null,null,0,0,0,0,0,0,0,0,0,0,0,0,0,0,0,0,0,0,0,0,0,0,0,0,0,0,0,0,0,0,0,0,0,0,0,0,0,0,0,0,0,0,0,0,0,0,0,0,0,0,0,0,0,0,0,0,0,0,0,0,0,0,0,0,0,0,0,0,0,0,0,0,0,0,0,0,0,0,0,0,0,0,0,0,0,0,0,0,0,0,0,0,0,0,0,0,0,0,0,null,null,null,null,null,null,null,null,null,null,null,null,null,null,null,null,null,"43N",null,null,null,null,null,null,null,{"$f":"IF($C$111=$B$112,M$121,IF($C$111=$B$113,M$122,IF($C$111=$B$114,M$123,\"\")))","v":"18W"}]
[0,9,"12N","41N",null,null,0,0,0,0,0,0,0,0,0,0,0,0,0,0,0,0,0,0,0,0,0,0,0,0,0,0,0,0,0,0,0,0,0,0,0,0,0,0,0,0,0,0,0,0,0,0,0,0,0,0,0,0,0,0,0,0,0,0,0,0,0,0,0,0,0,0,0,0,0,0,0,0,0,0,0,0,0,0,0,0,0,0,0,0,0,0,0,0,0,0,0,0,0,0,0,0,0,0,0,null,null,null,null,null,null,null,null,null,null,null,null,null,null,null,null,null,"42N",null,null,null,null,null,null,null,{"$f":"IF($C$111=$B$112,N$121,IF($C$111=$B$113,N$122,IF($C$111=$B$114,N$123,\"\")))","v":"17W"}]
[0,10,"11N","40N",null,null,0,0,0,0,0,0,0,0,0,0,0,0,0,0,0,0,0,0,0,0,0,0,0,0,0,0,0,0,0,0,0,0,0,0,0,0,0,0,0,0,0,0,0,0,0,0,0,0,0,0,0,0,0,0,0,0,0,0,0,0,0,0,0,0,0,0,0,0,0,0,0,0,0,0,0,0,0,0,0,0,0,0,0,0,0,0,0,0,0,0,0,0,0,0,0,0,0,0,0,null,null,null,null,null,null,null,null,null,null,null,null,null,null,null,null,null,"41N",null,null,null,null,null,null,null,{"$f":"IF($C$111=$B$112,O$121,IF($C$111=$B$113,O$122,IF($C$111=$B$114,O$123,\"\")))","v":"16W"}]
[0,11,"10N","39N",null,null,0,0,0,0,0,0,0,0,0,0,0,0,0,0,0,0,0,0,0,0,0,0,0,0,0,0,0,0,0,0,0,0,0,0,0,0,0,0,0,0,0,0,0,0,0,0,0,0,0,0,0,0,0,0,0,0,0,0,0,0,0,0,0,0,0,0,0,0,0,0,0,0,0,0,0,0,0,0,0,0,0,0,0,0,0,0,0,0,0,0,0,0,0,0,0,0,0,0,0,null,null,null,null,null,null,null,null,null,null,null,null,null,null,null,null,null,"40N",null,null,null,null,null,null,null,{"$f":"IF($C$111=$B$112,P$121,IF($C$111=$B$113,P$122,IF($C$111=$B$114,P$123,\"\")))","v":"15W"}]
[0,12,"9N","38N",null,null,0,0,0,0,0,0,0,0,0,0,0,0,0,0,0,0,0,0,0,0,0,0,0,0,0,0,0,0,0,0,0,0,0,0,0,0,0,0,0,0,0,0,0,0,0,0,0,0,0,0,0,0,0,0,0,0,0,0,0,0,0,0,0,0,0,0,0,0,0,0,0,0,0,0,0,0,0,0,0,0,0,0,0,0,0,0,0,0,0,0,0,0,0,0,0,0,0,0,0,null,null,null,null,null,null,null,null,null,null,null,null,null,null,null,null,null,"39N",null,null,null,null,null,null,null,{"$f":"IF($C$111=$B$112,Q$121,IF($C$111=$B$113,Q$122,IF($C$111=$B$114,Q$123,\"\")))","v":"14W"}]
[0,13,"8N","37N",null,null,0,0,0,0,0,0,0,0,0,0,0,0,0,0,0,0,0,0,0,0,0,0,0,0,0,0,0,0,0,0,0,0,0,0,0,0,0,0,0,0,0,0,0,0,0,0,0,0,0,0,0,0,0,0,0,0,0,0,0,0,0,0,0,0,0,0,0,0,0,0,0,0,0,0,0,0,0,0,0,0,0,0,0,0,0,0,0,0,0,0,0,0,0,0,0,0,0,0,0,null,null,null,null,null,null,null,null,null,null,null,null,null,null,null,null,null,"38N",null,null,null,null,null,null,null,{"$f":"IF($C$111=$B$112,R$121,IF($C$111=$B$113,R$122,IF($C$111=$B$114,R$123,\"\")))","v":"13W"}]
[0,14,"7N","36N",null,null,0,0,0,0,0,0,0,0,0,0,0,0,0,0,0,0,0,0,0,0,0,0,0,0,0,0,0,0,0,0,0,0,0,0,0,0,0,0,0,0,0,0,0,0,0,0,0,0,0,0,0,0,0,0,0,0,0,0,0,0,0,0,0,0,0,0,0,0,0,0,0,0,0,0,0,0,0,0,0,0,0,0,0,0,0,0,0,0,0,0,0,0,0,0,0,0,0,0,0,null,null,null,null,null,null,null,null,null,null,null,null,null,null,null,null,null,"37N",null,null,null,null,null,null,null,{"$f":"IF($C$111=$B$112,S$121,IF($C$111=$B$113,S$122,IF($C$111=$B$114,S$123,\"\")))","v":"12W"}]
[0,15,"6N","35N",null,null,0,0,0,0,0,0,0,0,0,0,0,0,0,0,0,0,0,0,0,0,0,0,0,0,0,0,0,0,0,0,0,0,0,0,0,0,0,0,0,0,0,0,0,0,0,0,0,0,0,0,0,0,0,0,0,0,0,0,0,0,0,0,0,0,0,0,0,0,0,0,0,0,0,0,0,0,0,0,0,0,0,0,0,0,0,0,0,0,0,0,0,0,0,0,0,0,0,0,0,null,null,null,null,null,null,null,null,null,null,null,null,null,null,null,null,null,"36N",null,null,null,null,null,null,null,{"$f":"IF($C$111=$B$112,T$121,IF($C$111=$B$113,T$122,IF($C$111=$B$114,T$123,\"\")))","v":"11W"}]
[0,16,"5N","34N",null,null,0,0,0,0,0,0,0,0,0,0,0,0,0,0,0,0,{"$f":"MIN(W$125,$A142)","v":0},0,0,0,0,0,0,0,0,0,0,0,0,0,0,0,{"$f":"MIN(AM$125,$A142)","v":0},0,0,0,0,0,0,0,0,0,0,0,0,0,0,0,{"$f":"MIN(BC$125,$A142)","v":0},0,0,0,0,0,0,0,0,0,0,0,0,0,0,0,{"$f":"MIN(BS$125,$A142)","v":0},0,0,0,0,0,0,0,0,0,0,0,0,0,0,0,{"$f":"MIN(CI$125,$A142)","v":0},0,0,0,0,0,0,0,0,0,0,0,0,0,0,0,{"$f":"MIN(CY$125,$A142)","v":0},0,0,null,null,null,null,null,null,null,null,null,null,null,null,null,null,null,null,null,"35N",null,null,null,null,null,null,null,{"$f":"IF($C$111=$B$112,U$121,IF($C$111=$B$113,U$122,IF($C$111=$B$114,U$123,\"\")))","v":"10W"}]
[0,17,"4N","33N",null,null,0,{"$f":"MIN(H$125,$A143)","v":0},0,0,0,0,0,0,0,0,0,0,0,0,0,0,0,0,0,0,0,0,0,0,0,0,0,0,0,0,0,0,0,0,0,0,0,0,0,0,0,0,0,0,0,0,0,0,0,0,0,0,0,0,0,0,0,0,0,0,0,0,0,0,0,0,0,0,0,0,0,0,0,0,0,0,0,0,0,0,0,0,0,0,0,0,0,0,0,0,0,0,0,0,0,0,0,0,0,null,null,null,null,null,null,null,null,null,null,null,null,null,null,null,null,null,"34N",null,null,null,null,null,null,null,{"$f":"IF($C$111=$B$112,V$121,IF($C$111=$B$113,V$122,IF($C$111=$B$114,V$123,\"\")))","v":"9W"}]
[0,18,"3N","32N",null,null,{"$f":"MIN(G$125,$A144)","v":0},0,0,0,0,0,0,0,0,0,0,0,0,0,0,0,0,0,0,0,0,0,0,0,0,0,0,0,0,0,0,0,0,0,0,0,0,0,0,0,0,0,0,0,0,0,0,0,0,0,0,0,0,0,0,0,0,0,0,0,0,0,0,0,0,0,0,0,0,0,0,0,0,0,0,0,0,0,0,0,0,0,0,0,0,0,0,0,0,0,0,0,0,0,0,0,0,0,0,null,null,null,null,null,null,null,null,null,null,null,null,null,null,null,null,null,"33N",null,null,null,null,null,null,null,{"$f":"IF($C$111=$B$112,W$121,IF($C$111=$B$113,W$122,IF($C$111=$B$114,W$123,\"\")))","v":"8W"}]
[0,19,"2N","31N",null,null,0,0,0,0,0,0,0,0,0,0,0,0,0,0,0,0,0,0,0,0,0,0,0,0,0,0,0,0,0,0,0,0,0,0,0,0,0,0,0,0,0,0,0,0,0,0,0,0,0,0,0,0,0,0,0,0,0,0,0,0,0,0,0,0,0,0,0,0,0,0,0,0,0,0,0,0,0,0,0,0,0,0,0,0,0,0,0,0,0,0,0,0,0,0,0,0,0,0,0,null,null,null,null,null,null,null,null,null,null,null,null,null,null,null,null,null,"32N",null,null,null,null,null,null,null,{"$f":"IF($C$111=$B$112,X$121,IF($C$111=$B$113,X$122,IF($C$111=$B$114,X$123,\"\")))","v":"7W"}]
[0,20,"1N","30N",null,null,0,0,0,0,0,0,0,0,0,0,0,0,0,0,0,0,0,0,0,0,0,0,0,0,0,0,0,0,0,0,0,0,0,0,0,0,0,0,0,0,0,0,0,0,0,0,0,0,0,0,0,0,0,0,0,0,0,0,0,0,0,0,0,0,0,0,0,0,0,0,0,0,0,0,0,0,0,0,0,0,0,0,0,0,0,0,0,0,0,0,0,0,0,0,0,0,0,0,0,null,null,null,null,null,null,null,null,null,null,null,null,null,null,null,null,null,"31N",null,null,null,null,null,null,null,{"$f":"IF($C$111=$B$112,Y$121,IF($C$111=$B$113,Y$122,IF($C$111=$B$114,Y$123,\"\")))","v":"6W"}]
[0,21,"1S","29N",null,null,0,0,0,0,0,0,0,0,0,0,0,0,0,0,0,0,0,0,0,0,0,0,0,0,0,0,0,0,0,0,0,0,0,0,0,0,0,0,0,0,0,0,0,0,0,0,0,0,0,0,0,0,0,0,0,0,0,0,0,0,0,0,0,0,0,0,0,0,0,0,0,0,0,0,0,0,0,0,0,0,0,0,0,0,0,0,0,0,0,0,0,0,0,0,0,0,0,0,0,null,null,null,null,null,null,null,null,null,null,null,null,null,null,null,null,null,"30N",null,null,null,null,null,null,null,{"$f":"IF($C$111=$B$112,Z$121,IF($C$111=$B$113,Z$122,IF($C$111=$B$114,Z$123,\"\")))","v":"5W"}]
[0,22,"2S","28N",null,null,0,0,0,0,0,0,0,0,0,0,0,0,0,0,0,0,0,0,0,0,0,0,0,0,0,0,0,0,0,0,0,0,0,0,0,0,0,0,0,0,0,0,0,0,0,0,0,0,0,0,0,0,0,0,0,0,0,0,0,0,0,0,0,0,0,0,0,0,0,0,0,0,0,0,0,0,0,0,0,0,0,0,0,0,0,0,0,0,0,0,0,0,0,0,0,0,0,0,0,null,null,null,null,null,null,null,null,null,null,null,null,null,null,null,null,null,"29N",null,null,null,null,null,null,null,{"$f":"IF($C$111=$B$112,AA$121,IF($C$111=$B$113,AA$122,IF($C$111=$B$114,AA$123,\"\")))","v":"4W"}]
[0,23,"3S","27N",null,null,0,0,0,0,0,0,0,0,0,0,0,0,0,0,0,0,0,0,0,0,0,0,0,0,0,0,0,0,0,0,0,0,0,0,0,0,0,0,0,0,0,0,0,0,0,0,0,0,0,0,0,0,0,0,0,0,0,0,0,0,0,0,0,0,0,0,0,0,0,0,0,0,0,0,0,0,0,0,0,0,0,0,0,0,0,0,0,0,0,0,0,0,0,0,0,0,0,0,0,null,null,null,null,null,null,null,null,null,null,null,null,null,null,null,null,null,"28N",null,null,null,null,null,null,null,{"$f":"IF($C$111=$B$112,AB$121,IF($C$111=$B$113,AB$122,IF($C$111=$B$114,AB$123,\"\")))","v":"3W"}]
[0,24,"4S","26N",null,null,0,0,0,0,0,0,0,0,0,0,0,0,0,0,0,0,0,0,0,0,0,0,0,0,0,0,0,0,0,0,0,0,0,0,0,0,0,0,0,0,0,0,0,0,0,0,0,0,0,0,0,0,0,0,0,0,0,0,0,0,0,0,0,0,0,0,0,0,0,0,0,0,0,0,0,0,0,0,0,0,0,0,0,0,0,0,0,0,0,0,0,0,0,0,0,0,0,0,0,null,null,null,null,null,null,null,null,null,null,null,null,null,null,null,null,null,"27N",null,null,null,null,null,null,null,{"$f":"IF($C$111=$B$112,AC$121,IF($C$111=$B$113,AC$122,IF($C$111=$B$114,AC$123,\"\")))","v":"2W"}]
[0,25,"5S","25N",null,null,0,0,0,0,0,0,0,0,0,0,0,0,0,0,0,0,0,0,0,0,0,0,0,0,0,0,0,0,0,0,0,0,0,0,0,0,0,0,0,0,0,0,0,0,0,0,0,0,0,0,0,0,0,0,0,0,0,0,0,0,0,0,0,0,0,0,0,0,0,0,0,0,0,0,0,0,0,0,0,0,0,0,0,0,0,0,0,0,0,0,0,0,0,0,0,0,0,0,0,null,null,null,null,null,null,null,null,null,null,null,null,null,null,null,null,null,"26N",null,null,null,null,null,null,null,{"$f":"IF($C$111=$B$112,AD$121,IF($C$111=$B$113,AD$122,IF($C$111=$B$114,AD$123,\"\")))","v":"1W"}]
[0,26,"6S","24N",null,null,0,0,0,0,0,0,0,0,0,0,0,0,0,0,0,0,0,0,0,0,0,0,0,0,0,0,0,0,0,0,0,0,0,0,0,0,0,0,0,0,0,0,0,0,0,0,0,0,0,0,0,0,0,0,0,0,0,0,0,0,0,0,0,0,0,0,0,0,0,0,0,0,0,0,0,0,0,0,0,0,0,0,0,0,0,0,0,0,0,0,0,0,0,0,0,0,0,0,0,null,null,null,null,null,null,null,null,null,null,null,null,null,null,null,null,null,"25N",null,null,null,null,null,null,null,{"$f":"IF($C$111=$B$112,AE$121,IF($C$111=$B$113,AE$122,IF($C$111=$B$114,AE$123,\"\")))","v":"1E"}]
[0,27,null,"23N",null,null,0,0,0,0,0,0,0,0,0,0,0,0,0,0,0,0,0,0,0,0,0,0,0,0,0,0,0,0,0,0,0,0,0,0,0,0,0,0,0,0,0,0,0,0,0,0,0,0,0,0,0,0,0,0,0,0,0,0,0,0,0,0,0,0,0,0,0,0,0,0,0,0,0,0,0,0,0,0,0,0,0,0,0,0,0,0,0,0,0,0,0,0,0,0,0,0,0,0,0,null,null,null,null,null,null,null,null,null,null,null,null,null,null,null,null,null,"24N",null,null,null,null,null,null,null,{"$f":"IF($C$111=$B$112,AF$121,IF($C$111=$B$113,AF$122,IF($C$111=$B$114,AF$123,\"\")))","v":"2E"}]
[0,28,null,"22N",null,null,0,0,0,0,0,0,0,0,0,0,0,0,0,0,0,0,0,0,0,0,0,0,0,0,0,0,0,0,0,0,0,0,0,0,0,0,0,0,0,0,0,0,0,0,0,0,0,0,0,0,0,0,0,0,0,0,0,0,0,0,0,0,0,0,0,0,0,0,0,0,0,0,0,0,0,0,0,0,0,0,0,0,0,0,0,0,0,0,0,0,0,0,0,0,0,0,0,0,0,null,null,null,null,null,null,null,null,null,null,null,null,null,null,null,null,null,"23N",null,null,null,null,null,null,null,{"$f":"IF($C$111=$B$112,AG$121,IF($C$111=$B$113,AG$122,IF($C$111=$B$114,AG$123,\"\")))","v":"3E"}]
[0,29,null,"21N",null,null,0,0,0,0,0,0,0,0,0,0,0,0,0,0,0,0,0,0,0,0,0,0,0,0,0,0,0,0,0,0,0,0,0,0,0,0,0,0,0,0,0,0,0,0,0,0,0,0,0,0,0,0,0,0,0,0,0,0,0,0,0,0,0,0,0,0,0,0,0,0,0,0,0,0,0,0,0,0,0,0,0,0,0,0,0,0,0,0,0,0,0,0,0,0,0,0,0,0,0,null,null,null,null,null,null,null,null,null,null,null,null,null,null,null,null,null,"22N",null,null,null,null,null,null,null,{"$f":"IF($C$111=$B$112,AH$121,IF($C$111=$B$113,AH$122,IF($C$111=$B$114,AH$123,\"\")))","v":"4E"}]
[0,30,null,"20N",null,null,0,0,0,0,0,0,0,0,0,0,0,0,0,0,0,0,0,0,0,0,0,0,0,0,0,0,0,0,0,0,0,0,0,0,0,0,0,0,0,0,0,0,0,0,0,0,0,0,0,0,0,0,0,0,0,0,0,0,0,0,0,0,0,0,0,0,0,0,0,0,0,0,0,0,0,0,0,0,0,0,0,0,0,0,0,0,0,0,0,0,0,0,0,0,0,0,0,0,0,null,null,null,null,null,null,null,null,null,null,null,null,null,null,null,null,null,"21N",null,null,null,null,null,null,null,{"$f":"IF($C$111=$B$112,AI$121,IF($C$111=$B$113,AI$122,IF($C$111=$B$114,AI$123,\"\")))","v":"5E"}]
[0,31,null,"19N",null,null,0,0,0,0,0,0,0,0,0,0,0,0,0,0,0,0,0,0,0,0,0,0,0,0,0,0,0,0,0,0,0,0,0,0,0,0,0,0,0,0,0,0,0,0,0,0,0,0,0,0,0,0,0,0,0,0,0,0,0,0,0,0,0,0,0,0,0,0,0,0,0,0,0,0,0,0,0,0,0,0,0,0,0,0,0,0,0,0,0,0,0,0,0,0,0,0,0,0,0,null,null,null,null,null,null,null,null,null,null,null,null,null,null,null,null,null,"20N",null,null,null,null,null,null,null,{"$f":"IF($C$111=$B$112,AJ$121,IF($C$111=$B$113,AJ$122,IF($C$111=$B$114,AJ$123,\"\")))","v":"6E"}]
[0,32,null,"18N",null,null,0,0,0,0,0,0,0,0,0,0,0,0,0,0,0,0,{"$f":"MIN(W$125,$A158)","v":0},0,0,0,0,0,0,0,0,0,0,0,0,0,0,0,{"$f":"MIN(AM$125,$A158)","v":0},0,0,0,0,0,0,0,0,0,0,0,0,0,0,0,{"$f":"MIN(BC$125,$A158)","v":0},0,0,0,0,0,0,0,0,0,0,0,0,0,0,0,{"$f":"MIN(BS$125,$A158)","v":0},0,0,0,0,0,0,0,0,0,0,0,0,0,0,0,{"$f":"MIN(CI$125,$A158)","v":0},0,0,0,0,0,0,0,0,0,0,0,0,0,0,0,0,0,0,null,null,null,null,null,null,null,null,null,null,null,null,null,null,null,null,null,"19N",null,null,null,null,null,null,null,{"$f":"IF($C$111=$B$112,AK$121,IF($C$111=$B$113,AK$122,IF($C$111=$B$114,AK$123,\"\")))","v":"7E"}]
[0,33,null,"17N",null,null,0,0,0,0,0,0,0,0,0,0,0,0,0,0,0,{"$f":"MIN(V$125,$A159)","v":0},0,0,0,0,0,0,0,0,0,0,0,0,0,0,0,0,0,0,0,0,0,0,0,0,0,0,0,0,0,0,0,0,0,0,0,0,0,0,0,0,0,0,0,0,0,0,0,0,0,0,0,0,0,0,0,0,0,0,0,0,0,0,0,0,0,0,0,0,0,0,0,0,0,0,0,0,0,0,0,0,0,0,0,null,null,null,null,null,null,null,null,null,null,null,null,null,null,null,null,null,"18N",null,null,null,null,null,null,null,{"$f":"IF($C$111=$B$112,AL$121,IF($C$111=$B$113,AL$122,IF($C$111=$B$114,AL$123,\"\")))","v":"8E"}]
[0,34,null,"16N",null,null,{"$f":"MIN(G$125,$A160)","v":0},0,0,0,0,0,0,0,0,0,0,0,0,0,0,0,0,0,0,0,0,0,0,0,0,0,0,0,0,0,0,0,0,0,0,0,0,0,0,0,0,0,0,0,0,0,0,0,0,0,0,0,0,0,0,0,0,0,0,0,0,0,0,0,0,0,0,0,0,0,0,0,0,0,0,0,0,0,0,0,0,0,0,0,0,0,0,0,0,0,0,0,0,0,0,0,0,0,0,null,null,null,null,null,null,null,null,null,null,null,null,null,null,null,null,null,{"$f":"IF($C$111=$B$112,C159,IF($C$111=$B$113,D159,IF($C$111=$B$114,E159,\"\")))","v":"17N"},null,null,null,null,null,null,null,{"$f":"IF($C$111=$B$112,AM$121,IF($C$111=$B$113,AM$122,IF($C$111=$B$114,AM$123,\"\")))","v":"9E"}]
[0,35,null,"15N",null,null,0,0,0,0,0,0,0,0,0,0,0,0,0,0,0,0,0,0,0,0,0,0,0,0,0,0,0,0,0,0,0,0,0,0,0,0,0,0,0,0,0,0,0,0,0,0,0,0,0,0,0,0,0,0,0,0,0,0,0,0,0,0,0,0,0,0,0,0,0,0,0,0,0,0,0,0,0,0,0,0,0,0,0,0,0,0,0,0,0,0,0,0,0,0,0,0,0,0,0,null,null,null,null,null,null,null,null,null,null,null,null,null,null,null,null,null,"16N",null,null,null,null,null,null,null,{"$f":"IF($C$111=$B$112,AN$121,IF($C$111=$B$113,AN$122,IF($C$111=$B$114,AN$123,\"\")))","v":"10E"}]
[0,36,null,"14N",null,null,0,0,0,0,0,0,0,0,0,0,0,0,0,0,0,0,0,0,0,0,0,0,0,0,0,0,0,0,0,0,0,0,0,0,0,0,0,0,0,0,0,0,0,0,0,0,0,0,0,0,0,0,0,0,0,0,0,0,0,0,0,0,0,0,0,0,0,0,0,0,0,0,0,0,0,0,0,0,0,0,0,0,0,0,0,0,0,0,0,0,0,0,0,0,0,0,{"$f":"MIN(CY$125,$A162)","v":0},0,0,null,null,null,null,null,null,null,null,null,null,null,null,null,null,null,null,null,"15N",null,null,null,null,null,null,null,{"$f":"IF($C$111=$B$112,AO$121,IF($C$111=$B$113,AO$122,IF($C$111=$B$114,AO$123,\"\")))","v":"11E"}]
[0,37,null,"13N",null,null,0,0,0,0,0,0,0,0,0,0,0,0,0,0,0,0,0,0,0,0,0,0,0,0,0,0,0,0,0,0,0,0,0,0,0,0,0,0,0,0,0,0,0,0,0,0,0,0,0,0,0,0,0,0,0,0,0,0,0,0,0,0,0,0,0,0,0,0,0,0,0,0,0,0,0,0,0,0,0,0,0,0,0,0,0,0,0,0,0,0,0,0,0,0,0,0,0,0,0,null,null,null,null,null,null,null,null,null,null,null,null,null,null,null,null,null,"14N",null,null,null,null,null,null,null,{"$f":"IF($C$111=$B$112,AP$121,IF($C$111=$B$113,AP$122,IF($C$111=$B$114,AP$123,\"\")))","v":"12E"}]
[0,38,null,"12N",null,null,0,0,0,0,0,0,0,0,0,0,0,0,0,0,0,0,0,0,0,0,0,0,0,0,0,0,0,0,0,0,0,0,0,0,0,0,0,0,0,0,0,0,0,0,0,0,0,0,0,0,0,0,0,0,0,0,0,0,0,0,0,0,0,0,0,0,0,0,0,0,0,0,0,0,0,0,0,0,0,0,0,0,0,0,0,0,0,0,0,0,0,0,0,0,0,0,0,0,0,null,null,null,null,null,null,null,null,null,null,null,null,null,null,null,null,null,"13N",null,null,null,null,null,null,null,{"$f":"IF($C$111=$B$112,AQ$121,IF($C$111=$B$113,AQ$122,IF($C$111=$B$114,AQ$123,\"\")))","v":"13E"}]
[0,39,null,"11N",null,null,0,0,0,0,0,0,0,0,0,0,0,0,0,0,0,0,0,0,0,0,0,0,0,0,0,0,0,0,0,0,0,0,0,0,0,0,0,0,0,0,0,0,0,0,0,0,0,0,0,0,0,0,0,0,0,0,0,0,0,0,0,0,0,0,0,0,0,0,0,0,0,0,0,0,0,0,0,0,0,0,0,0,0,0,0,0,0,0,0,0,0,0,0,0,0,0,0,0,0,null,null,null,null,null,null,null,null,null,null,null,null,null,null,null,null,null,"12N",null,null,null,null,null,null,null,{"$f":"IF($C$111=$B$112,AR$121,IF($C$111=$B$113,AR$122,IF($C$111=$B$114,AR$123,\"\")))","v":"14E"}]
[0,40,null,"10N",null,null,0,0,0,0,0,0,0,0,0,0,0,0,0,0,0,0,0,0,0,0,0,0,0,0,0,0,0,0,0,0,0,0,0,0,0,0,0,0,0,0,0,0,0,0,0,0,0,0,0,0,0,0,0,0,0,0,0,0,0,0,0,0,0,0,0,0,0,0,0,0,0,0,0,0,0,0,0,0,0,0,0,0,0,0,0,0,0,0,0,0,0,0,0,0,0,0,0,0,0,null,null,null,null,null,null,null,null,null,null,null,null,null,null,null,null,null,"11N",null,null,null,null,null,null,null,{"$f":"IF($C$111=$B$112,AS$121,IF($C$111=$B$113,AS$122,IF($C$111=$B$114,AS$123,\"\")))","v":"15E"}]
[0,41,null,"9N",null,null,0,0,0,0,0,0,0,0,0,0,0,0,0,0,0,0,0,0,0,0,0,0,0,0,0,0,0,0,0,0,0,0,0,0,0,0,0,0,0,0,0,0,0,0,0,0,0,0,0,0,0,0,0,0,0,0,0,0,0,0,0,0,0,0,0,0,0,0,0,0,0,0,0,0,0,0,0,0,0,0,0,0,0,0,0,0,0,0,0,0,0,0,0,0,0,0,0,0,0,null,null,null,null,null,null,null,null,null,null,null,null,null,null,null,null,null,"10N",null,null,null,null,null,null,null,{"$f":"IF($C$111=$B$112,AT$121,IF($C$111=$B$113,AT$122,IF($C$111=$B$114,AT$123,\"\")))","v":"16E"}]
[0,42,null,"8N",null,null,0,0,0,0,0,0,0,0,0,0,0,0,0,0,0,0,0,0,0,0,0,0,0,0,0,0,0,0,0,0,0,0,0,0,0,0,0,0,0,0,0,0,0,0,0,0,0,0,0,0,0,0,0,0,0,0,0,0,0,0,0,0,0,0,0,0,0,0,0,0,0,0,0,0,0,0,0,0,0,0,0,0,0,0,0,0,0,0,0,0,0,0,0,0,0,0,0,0,0,null,null,null,null,null,null,null,null,null,null,null,null,null,null,null,null,null,"9N",null,null,null,null,null,null,null,{"$f":"IF($C$111=$B$112,AU$121,IF($C$111=$B$113,AU$122,IF($C$111=$B$114,AU$123,\"\")))","v":"17E"}]
[0,43,null,"7N",null,null,0,0,0,0,0,0,0,0,0,0,0,0,0,0,0,0,0,0,0,0,0,0,0,0,0,0,0,0,0,0,0,0,0,0,0,0,0,0,0,0,0,0,0,0,0,0,0,0,0,0,0,0,0,0,0,0,0,0,0,0,0,0,0,0,0,0,0,0,0,0,0,0,0,0,0,0,0,0,0,0,0,0,0,0,0,0,0,0,0,0,0,0,0,0,0,0,0,0,0,null,null,null,null,null,null,null,null,null,null,null,null,null,null,null,null,null,"8N",null,null,null,null,null,null,null,{"$f":"IF($C$111=$B$112,AV$121,IF($C$111=$B$113,AV$122,IF($C$111=$B$114,AV$123,\"\")))","v":"18E"}]
[0,44,null,"6N",null,null,0,0,0,0,0,0,0,0,0,0,0,0,0,0,0,0,0,0,0,0,0,0,0,0,0,0,0,0,0,0,0,0,0,0,0,0,0,0,0,0,0,0,0,0,0,0,0,0,0,0,0,0,0,0,0,0,0,0,0,0,0,0,0,0,0,0,0,0,0,0,0,0,0,0,0,0,0,0,0,0,0,0,0,0,0,0,0,0,0,0,0,0,0,0,0,0,0,0,0,null,null,null,null,null,null,null,null,null,null,null,null,null,null,null,null,null,"7N",null,null,null,null,null,null,null,{"$f":"IF($C$111=$B$112,AW$121,IF($C$111=$B$113,AW$122,IF($C$111=$B$114,AW$123,\"\")))","v":"19E"}]
[0,45,null,"5N",null,null,0,0,0,0,0,0,0,0,0,0,0,0,0,0,0,0,0,0,0,0,0,0,0,0,0,0,0,0,0,0,0,0,0,0,0,0,0,0,0,0,0,0,0,0,0,0,0,0,0,0,0,0,0,0,0,0,0,0,0,0,0,0,0,0,0,0,0,0,0,0,0,0,0,0,0,0,0,0,0,0,0,0,0,0,0,0,0,0,0,0,0,0,0,0,0,0,0,0,0,null,null,null,null,null,null,null,null,null,null,null,null,null,null,null,null,null,"6N",null,null,null,null,null,null,null,{"$f":"IF($C$111=$B$112,AX$121,IF($C$111=$B$113,AX$122,IF($C$111=$B$114,AX$123,\"\")))","v":"20E"}]
[0,46,null,"4N",null,null,0,0,0,0,0,0,0,0,0,0,0,0,0,0,0,0,0,0,0,0,0,0,0,0,0,0,0,0,0,0,0,0,0,0,0,0,0,0,0,0,0,0,0,0,0,0,0,0,0,0,0,0,0,0,0,0,0,0,0,0,0,0,0,0,0,0,0,0,0,0,0,0,0,0,0,0,0,0,0,0,0,0,0,0,0,0,0,0,0,0,0,0,0,0,0,0,0,0,0,null,null,null,null,null,null,null,null,null,null,null,null,null,null,null,null,null,"5N",null,null,null,null,null,null,null,{"$f":"IF($C$111=$B$112,AY$121,IF($C$111=$B$113,AY$122,IF($C$111=$B$114,AY$123,\"\")))","v":"21E"}]
[0,47,null,"3N",null,null,0,0,0,0,0,0,0,0,0,0,0,0,0,0,0,0,0,0,0,0,0,0,0,0,0,0,0,0,0,0,0,{"$f":"MIN(AL$125,$A173)","v":0},0,0,0,0,0,0,0,0,0,0,0,0,0,0,0,{"$f":"MIN(BB$125,$A173)","v":0},0,0,0,0,0,0,0,0,0,0,0,0,0,0,0,{"$f":"MIN(BR$125,$A173)","v":0},0,0,0,0,0,0,0,0,0,0,0,0,0,0,0,{"$f":"MIN(CH$125,$A173)","v":0},0,0,0,0,0,0,0,0,0,0,0,0,0,0,0,{"$f":"MIN(CX$125,$A173)","v":0},0,0,0,null,null,null,null,null,null,null,null,null,null,null,null,null,null,null,null,null,"4N",null,null,null,null,null,null,null,{"$f":"IF($C$111=$B$112,AZ$121,IF($C$111=$B$113,AZ$122,IF($C$111=$B$114,AZ$123,\"\")))","v":"22E"}]
[0,48,null,"2N",null,null,0,0,0,0,0,0,0,0,0,0,0,0,0,0,0,0,{"$f":"MIN(W$125,$A174)","v":0},0,0,0,0,0,0,0,0,0,0,0,0,0,0,0,0,0,0,0,0,0,0,0,0,0,0,0,0,0,0,0,0,0,0,0,0,0,0,0,0,0,0,0,0,0,0,0,0,0,0,0,0,0,0,0,0,0,0,0,0,0,0,0,0,0,0,0,0,0,0,0,0,0,0,0,0,0,0,0,0,0,0,null,null,null,null,null,null,null,null,null,null,null,null,null,null,null,null,null,"3N",null,null,null,null,null,null,null,{"$f":"IF($C$111=$B$112,BA$121,IF($C$111=$B$113,BA$122,IF($C$111=$B$114,BA$123,\"\")))","v":"23E"}]
[0,49,null,"1N",null,null,0,0,0,0,0,0,0,0,0,0,0,0,0,0,0,0,{"$f":"MIN(W$125,$A175)","v":0},0,0,0,0,0,0,0,0,0,0,0,0,0,0,0,0,0,0,0,0,0,0,0,0,0,0,0,0,0,0,0,0,0,0,0,0,0,0,0,0,0,0,0,0,0,0,0,0,0,0,0,0,0,0,0,0,0,0,0,0,0,0,0,0,0,0,0,0,0,0,0,0,0,0,0,0,0,0,0,0,0,0,null,null,null,null,null,null,null,null,null,null,null,null,null,null,null,null,null,"2N",null,null,null,null,null,null,null,{"$f":"IF($C$111=$B$112,BB$121,IF($C$111=$B$113,BB$122,IF($C$111=$B$114,BB$123,\"\")))","v":"24E"}]
[0,50,null,"1S",null,null,{"$f":"MIN(G$125,$A176)","v":0},0,0,0,0,0,0,0,0,0,0,0,0,0,0,0,0,0,0,0,0,0,0,0,0,0,0,0,0,0,0,0,0,0,0,0,0,0,0,0,0,0,0,0,0,0,0,0,0,0,0,0,0,0,0,0,0,0,0,0,0,0,0,0,0,0,0,0,0,0,0,0,0,0,0,0,0,0,0,0,0,0,0,0,0,0,0,0,0,0,0,0,0,0,0,0,0,0,0,null,null,null,null,null,null,null,null,null,null,null,null,null,null,null,null,null,"1N",null,null,null,null,null,null,null,{"$f":"IF($C$111=$B$112,BC$121,IF($C$111=$B$113,BC$122,IF($C$111=$B$114,BC$123,\"\")))","v":"25E"}]
[0,51,null,"2S",null,null,0,0,0,0,0,0,0,0,0,0,0,0,0,0,0,0,0,0,0,0,0,0,0,0,0,0,0,0,0,0,0,0,0,0,0,0,0,0,0,0,0,0,0,0,0,0,0,0,0,0,0,0,0,0,0,0,0,0,0,0,0,0,0,0,0,0,0,0,0,0,0,0,0,0,0,0,0,0,0,0,0,0,0,0,0,0,0,0,0,0,0,0,0,0,0,0,0,0,0,null,null,null,null,null,null,null,null,null,null,null,null,null,null,null,null,null,"1S",null,null,null,null,null,null,null,{"$f":"IF($C$111=$B$112,BD$121,IF($C$111=$B$113,BD$122,IF($C$111=$B$114,BD$123,\"\")))","v":"26E"}]
[0,52,null,"3S",null,null,0,0,0,0,0,0,0,0,0,0,0,0,0,0,0,0,0,0,0,0,0,0,0,0,0,0,0,0,0,0,0,0,0,0,0,0,0,0,0,0,0,0,0,0,0,0,0,0,0,0,0,0,0,0,0,0,0,0,0,0,0,0,0,0,0,0,0,0,0,0,0,0,0,0,0,0,0,0,0,0,0,0,0,0,0,0,0,0,0,0,0,0,0,0,0,0,0,0,0,null,null,null,null,null,null,null,null,null,null,null,null,null,null,null,null,null,"2S",null,null,null,null,null,null,null,{"$f":"IF($C$111=$B$112,BE$121,IF($C$111=$B$113,BE$122,IF($C$111=$B$114,BE$123,\"\")))","v":"27E"}]
[0,53,null,"4S",null,null,0,0,0,0,0,0,0,0,0,0,0,0,0,0,0,0,0,0,0,0,0,0,0,0,0,0,0,0,0,0,0,0,0,0,0,0,0,0,0,0,0,0,0,0,0,0,0,0,0,0,0,0,0,0,0,0,0,0,0,0,0,0,0,0,0,0,0,0,0,0,0,0,0,0,0,0,0,0,0,0,0,0,0,0,0,0,0,0,0,0,0,0,0,0,0,0,0,0,0,null,null,null,null,null,null,null,null,null,null,null,null,null,null,null,null,null,"3S",null,null,null,null,null,null,null,{"$f":"IF($C$111=$B$112,BF$121,IF($C$111=$B$113,BF$122,IF($C$111=$B$114,BF$123,\"\")))","v":"28E"}]
[0,54,null,"5S",null,null,0,0,0,0,0,0,0,0,0,0,0,0,0,0,0,0,0,0,0,0,0,0,0,0,0,0,0,0,0,0,0,0,0,0,0,0,0,0,0,0,0,0,0,0,0,0,0,0,0,0,0,0,0,0,0,0,0,0,0,0,0,0,0,0,0,0,0,0,0,0,0,0,0,0,0,0,0,0,0,0,0,0,0,0,0,0,0,0,0,0,0,0,0,0,0,0,0,0,0,null,null,null,null,null,null,null,null,null,null,null,null,null,null,null,null,null,"4S",null,null,null,null,null,null,null,{"$f":"IF($C$111=$B$112,BG$121,IF($C$111=$B$113,BG$122,IF($C$111=$B$114,BG$123,\"\")))","v":"29E"}]
[0,55,null,"6S",null,null,0,0,0,0,0,0,0,0,0,0,0,0,0,0,0,0,0,0,0,0,0,0,0,0,0,0,0,0,0,0,0,0,0,0,0,0,0,0,0,0,0,0,0,0,0,0,0,0,0,0,0,0,0,0,0,0,0,0,0,0,0,0,0,0,0,0,0,0,0,0,0,0,0,0,0,0,0,0,0,0,0,0,0,0,0,0,0,0,0,0,0,0,0,0,0,0,0,0,0,null,null,null,null,null,null,null,null,null,null,null,null,null,null,null,null,null,"5S",null,null,null,null,null,null,null,{"$f":"IF($C$111=$B$112,BH$121,IF($C$111=$B$113,BH$122,IF($C$111=$B$114,BH$123,\"\")))","v":"30E"}]
[0,56,null,"7S",null,null,0,0,0,0,0,0,0,0,0,0,0,0,0,0,0,0,0,0,0,0,0,0,0,0,0,0,0,0,0,0,0,0,0,0,0,0,0,0,0,0,0,0,0,0,0,0,0,0,0,0,0,0,0,0,0,0,0,0,0,0,0,0,0,0,0,0,0,0,0,0,0,0,0,0,0,0,0,0,0,0,0,0,0,0,0,0,0,0,0,0,0,0,0,0,0,0,0,0,0,null,null,null,null,null,null,null,null,null,null,null,null,null,null,null,null,null,"6S",null,null,null,null,null,null,null,{"$f":"IF($C$111=$B$112,BI$121,IF($C$111=$B$113,BI$122,IF($C$111=$B$114,BI$123,\"\")))","v":"31E"}]
[0,57,null,"8S",null,null,0,0,0,0,0,0,0,0,0,0,0,0,0,0,0,0,0,0,0,0,0,0,0,0,0,0,0,0,0,0,0,0,0,0,0,0,0,0,0,0,0,0,0,0,0,0,0,0,0,0,0,0,0,0,0,0,0,0,0,0,0,0,0,0,0,0,0,0,0,0,0,0,0,0,0,0,0,0,0,0,0,0,0,0,0,0,0,0,0,0,0,0,0,0,0,0,0,0,0,null,null,null,null,null,null,null,null,null,null,null,null,null,null,null,null,null,"7S",null,null,null,null,null,null,null,{"$f":"IF($C$111=$B$112,BJ$121,IF($C$111=$B$113,BJ$122,IF($C$111=$B$114,BJ$123,\"\")))","v":"32E"}]
[0,58,null,"9S",null,null,0,0,0,0,0,0,0,0,0,0,0,0,0,0,0,0,0,0,0,0,0,0,0,0,0,0,0,0,0,0,0,0,0,0,0,0,0,0,0,0,0,0,0,0,0,0,0,0,0,0,0,0,0,0,0,0,0,0,0,0,0,0,0,0,0,0,0,0,0,0,0,0,0,0,0,0,0,0,0,0,0,0,0,0,0,0,0,0,0,0,0,0,0,0,0,0,0,0,0,null,null,null,null,null,null,null,null,null,null,null,null,null,null,null,null,null,"8S",null,null,null,null,null,null,null,{"$f":"IF($C$111=$B$112,BK$121,IF($C$111=$B$113,BK$122,IF($C$111=$B$114,BK$123,\"\")))","v":"33E"}]
[0,59,null,"10S",null,null,0,0,0,0,0,0,0,0,0,0,0,0,0,0,0,0,0,0,0,0,0,0,0,0,0,0,0,0,0,0,0,0,0,0,0,0,0,0,0,0,0,0,0,0,0,0,0,0,0,0,0,0,0,0,0,0,0,0,0,0,0,0,0,0,0,0,0,0,0,0,0,0,0,0,0,0,0,0,0,0,0,0,0,0,0,0,0,0,0,0,0,0,0,0,0,0,0,0,0,null,null,null,null,null,null,null,null,null,null,null,null,null,null,null,null,null,"9S",null,null,null,null,null,null,null,{"$f":"IF($C$111=$B$112,BL$121,IF($C$111=$B$113,BL$122,IF($C$111=$B$114,BL$123,\"\")))","v":"34E"}]
[0,60,null,"11S",null,null,0,0,0,0,0,0,0,0,0,0,0,0,0,0,0,0,0,0,0,0,0,0,0,0,0,0,0,0,0,0,0,0,0,0,0,0,0,0,0,0,0,0,0,0,0,0,0,0,0,0,0,0,0,0,0,0,0,0,0,0,0,0,0,0,0,0,0,0,0,0,0,0,0,0,0,0,0,0,0,0,0,0,0,0,0,0,0,0,0,0,0,0,0,0,0,0,0,0,0,null,null,null,null,null,null,null,null,null,null,null,null,null,null,null,null,null,"10S",null,null,null,null,null,null,null,{"$f":"IF($C$111=$B$112,BM$121,IF($C$111=$B$113,BM$122,IF($C$111=$B$114,BM$123,\"\")))","v":"35E"}]
[0,61,null,"12S",null,null,0,0,0,0,0,0,0,0,0,0,0,0,0,0,0,0,0,0,0,0,0,0,0,0,0,0,0,0,0,0,0,0,0,0,0,0,0,0,0,0,0,0,0,0,0,0,0,0,0,0,0,0,0,0,0,0,0,0,0,0,0,0,0,0,0,0,0,0,0,0,0,0,0,0,0,0,0,0,0,0,0,0,0,0,0,0,0,0,0,0,0,0,0,0,0,0,0,0,0,null,null,null,null,null,null,null,null,null,null,null,null,null,null,null,null,null,"11S",null,null,null,null,null,null,null,{"$f":"IF($C$111=$B$112,BN$121,IF($C$111=$B$113,BN$122,IF($C$111=$B$114,BN$123,\"\")))","v":"36E"}]
[0,62,null,"13S","31N",null,0,0,0,0,0,0,0,0,0,0,0,0,0,0,0,0,0,0,0,0,0,0,0,0,0,0,0,0,0,0,0,0,0,0,0,0,0,0,0,0,0,0,0,0,0,0,0,0,0,0,0,0,0,0,0,0,0,0,0,0,0,0,0,0,0,0,0,0,0,0,0,0,0,0,0,0,0,0,0,0,0,0,0,0,0,0,0,0,0,0,0,0,0,0,0,0,0,0,0,null,null,null,null,null,null,null,null,null,null,null,null,null,null,null,null,null,"12S",null,null,null,null,null,null,null,{"$f":"IF($C$111=$B$112,BO$121,IF($C$111=$B$113,BO$122,IF($C$111=$B$114,BO$123,\"\")))","v":"37E"}]
[0,63,null,"14S","30N",null,0,0,0,0,0,0,0,0,0,0,0,0,0,0,0,0,0,0,0,0,0,0,0,0,0,0,0,0,0,0,0,0,{"$f":"MIN(AM$125,$A189)","v":0},0,0,0,0,0,0,0,0,0,0,0,0,0,0,0,{"$f":"MIN(BC$125,$A189)","v":0},0,0,0,0,0,0,0,0,0,0,0,0,0,0,0,{"$f":"MIN(BS$125,$A189)","v":0},0,0,0,0,0,0,0,0,0,0,0,0,0,0,0,{"$f":"MIN(CI$125,$A189)","v":0},0,0,0,0,0,0,0,0,0,0,0,0,0,0,0,0,0,0,null,null,null,null,null,null,null,null,null,null,null,null,null,null,null,null,null,"13S",null,null,null,null,null,null,null,{"$f":"IF($C$111=$B$112,BP$121,IF($C$111=$B$113,BP$122,IF($C$111=$B$114,BP$123,\"\")))","v":"38E"}]
[0,64,null,"15S","29N",null,0,0,0,0,0,0,0,0,0,0,0,0,0,0,0,0,0,0,0,0,0,0,0,0,0,0,0,0,0,0,0,0,0,0,0,0,0,0,0,0,0,0,0,0,0,0,0,0,0,0,0,0,0,0,0,0,0,0,0,0,0,0,0,0,0,0,0,0,0,0,0,0,0,0,0,0,0,0,0,0,0,0,0,0,0,0,0,0,0,0,0,0,0,0,0,0,0,0,0,null,null,null,null,null,null,null,null,null,null,null,null,null,null,null,null,null,"14S",null,null,null,null,null,null,null,{"$f":"IF($C$111=$B$112,BQ$121,IF($C$111=$B$113,BQ$122,IF($C$111=$B$114,BQ$123,\"\")))","v":"39E"}]
[0,65,null,"16S","28N",null,0,0,0,0,0,0,0,0,0,0,0,0,0,0,0,{"$f":"MIN(V$125,$A191)","v":0},0,0,0,0,0,0,0,0,0,0,0,0,0,0,0,{"$f":"MIN(AL$125,$A191)","v":0},0,0,0,0,0,0,0,0,0,0,0,0,0,0,0,0,0,0,0,0,0,0,0,0,0,0,0,0,0,0,0,0,0,0,0,0,0,0,0,0,0,0,0,0,0,0,0,0,0,0,0,0,0,0,0,0,0,0,0,0,0,0,0,0,0,0,0,null,null,null,null,null,null,null,null,null,null,null,null,null,null,null,null,null,"15S",null,null,null,null,null,null,null,{"$f":"IF($C$111=$B$112,BR$121,IF($C$111=$B$113,BR$122,IF($C$111=$B$114,BR$123,\"\")))","v":"40E"}]
[{"$f":"IF($D$111=B192,1,0)","v":0},66,null,"17S","27N",null,{"$f":"MIN(G$125,$A192)","v":0},0,0,0,0,0,0,0,0,0,0,0,0,0,0,0,0,0,0,0,0,0,0,0,0,0,0,0,0,0,0,0,0,0,0,0,0,0,0,0,0,0,0,0,0,0,0,0,0,0,0,0,0,0,0,0,0,0,0,0,0,0,0,0,0,0,0,0,0,0,0,0,0,0,0,0,0,0,0,0,0,0,0,0,0,0,0,0,0,0,0,0,0,0,0,0,0,0,0,null,null,null,null,null,null,null,null,null,null,null,null,null,null,null,null,null,{"$f":"IF($C$111=$B$112,C191,IF($C$111=$B$113,D191,IF($C$111=$B$114,E191,\"\")))","v":"16S"},null,null,null,null,null,null,null,{"$f":"IF($C$111=$B$112,BS$121,IF($C$111=$B$113,BS$122,IF($C$111=$B$114,BS$123,\"\")))","v":"41E"}]
[0,{"$f":"B192+1","v":67},null,"18S","26N",null,0,0,0,0,0,0,0,0,0,0,0,0,0,0,0,0,0,0,0,0,0,0,0,0,0,0,0,0,0,0,0,0,0,0,0,0,0,0,0,0,0,0,0,0,0,0,0,0,0,0,0,0,0,0,0,0,0,0,0,0,0,0,0,0,0,0,0,0,0,0,0,0,0,0,0,0,0,0,0,0,0,0,0,0,0,0,0,0,0,0,0,0,0,0,0,0,{"$f":"MIN(CY$125,$A193)","v":0},0,0,null,null,null,null,null,null,null,null,null,null,null,null,null,null,null,null,null,"17S",null,null,null,null,null,null,null,{"$f":"IF($C$111=$B$112,BT$121,IF($C$111=$B$113,BT$122,IF($C$111=$B$114,BT$123,\"\")))","v":"42E"}]
[0,68,null,"19S","25N",null,0,0,0,0,0,0,0,0,0,0,0,0,0,0,0,0,0,0,0,0,0,0,0,0,0,0,0,0,0,0,0,0,0,0,0,0,0,0,0,0,0,0,0,0,0,0,0,0,0,0,0,0,0,0,0,0,0,0,0,0,0,0,0,0,0,0,0,0,0,0,0,0,0,0,0,0,0,0,0,0,0,0,0,0,0,0,0,0,0,0,0,0,0,0,0,0,0,0,0,null,null,null,null,null,null,null,null,null,null,null,null,null,null,null,null,null,"18S",null,null,null,null,null,null,null,{"$f":"IF($C$111=$B$112,BU$121,IF($C$111=$B$113,BU$122,IF($C$111=$B$114,BU$123,\"\")))","v":"43E"}]
[0,69,null,"20S","24N",null,0,0,0,0,0,0,0,0,0,0,0,0,0,0,0,0,0,0,0,0,0,0,0,0,0,0,0,0,0,0,0,0,0,0,0,0,0,0,0,0,0,0,0,0,0,0,0,0,0,0,0,0,0,0,0,0,0,0,0,0,0,0,0,0,0,0,0,0,0,0,0,0,0,0,0,0,0,0,0,0,0,0,0,0,0,0,0,0,0,0,0,0,0,0,0,0,0,0,0,null,null,null,null,null,null,null,null,null,null,null,null,null,null,null,null,null,"19S",null,null,null,null,null,null,null,{"$f":"IF($C$111=$B$112,BV$121,IF($C$111=$B$113,BV$122,IF($C$111=$B$114,BV$123,\"\")))","v":"44E"}]
[0,70,null,"21S","23N",null,0,0,0,0,0,0,0,0,0,0,0,0,0,0,0,0,0,0,0,0,0,0,0,0,0,0,0,0,0,0,0,0,0,0,0,0,0,0,0,0,0,0,0,0,0,0,0,0,0,0,0,0,0,0,0,0,0,0,0,0,0,0,0,0,0,0,0,0,0,0,0,0,0,0,0,0,0,0,0,0,0,0,0,0,0,0,0,0,0,0,0,0,0,0,0,0,0,0,0,null,null,null,null,null,null,null,null,null,null,null,null,null,null,null,null,null,"20S",null,null,null,null,null,null,null,{"$f":"IF($C$111=$B$112,BW$121,IF($C$111=$B$113,BW$122,IF($C$111=$B$114,BW$123,\"\")))","v":"45E"}]
[1,71,null,"22S","22N",null,0,0,0,0,0,0,0,0,0,0,0,0,0,0,0,0,0,0,0,0,0,0,0,0,0,0,0,0,0,0,0,0,0,0,0,0,0,0,0,0,0,1,0,0,0,0,0,0,0,0,0,0,0,0,0,0,0,0,0,0,0,0,0,0,0,0,0,0,0,0,0,0,0,0,0,0,0,0,0,0,0,0,0,0,0,0,0,0,0,0,0,0,0,0,0,0,0,0,0,null,null,null,null,null,null,null,null,null,null,null,null,null,null,null,null,null,"21S",null,null,null,null,null,null,null,{"$f":"IF($C$111=$B$112,BX$121,IF($C$111=$B$113,BX$122,IF($C$111=$B$114,BX$123,\"\")))","v":"46E"}]
[0,72,null,"23S","21N",null,0,0,0,0,0,0,0,0,0,0,0,0,0,0,0,0,0,0,0,0,0,0,0,0,0,0,0,0,0,0,0,0,0,0,0,0,0,0,0,0,0,0,0,0,0,0,0,0,0,0,0,0,0,0,0,0,0,0,0,0,0,0,0,0,0,0,0,0,0,0,0,0,0,0,0,0,0,0,0,0,0,0,0,0,0,0,0,0,0,0,0,0,0,0,0,0,0,0,0,null,null,null,null,null,null,null,null,null,null,null,null,null,null,null,null,null,"22S",null,null,null,null,null,null,null,{"$f":"IF($C$111=$B$112,BY$121,IF($C$111=$B$113,BY$122,IF($C$111=$B$114,BY$123,\"\")))","v":"47E"}]
[0,73,null,"24S","20N",null,0,0,0,0,0,0,0,0,0,0,0,0,0,0,0,0,0,0,0,0,0,0,0,0,0,0,0,0,0,0,0,0,0,0,0,0,0,0,0,0,0,0,0,0,0,0,0,0,0,0,0,0,0,0,0,0,0,0,0,0,0,0,0,0,0,0,0,0,0,0,0,0,0,0,0,0,0,0,0,0,0,0,0,0,0,0,0,0,0,0,0,0,0,0,0,0,0,0,0,null,null,null,null,null,null,null,null,null,null,null,null,null,null,null,null,null,"23S",null,null,null,null,null,null,null,{"$f":"IF($C$111=$B$112,BZ$121,IF($C$111=$B$113,BZ$122,IF($C$111=$B$114,BZ$123,\"\")))","v":0}]
[0,74,null,"25S","19N",null,0,0,0,0,0,0,0,0,0,0,0,0,0,0,0,0,0,0,0,0,0,0,0,0,0,0,0,0,0,0,0,0,0,0,0,0,0,0,0,0,0,0,0,0,0,0,0,0,0,0,0,0,0,0,0,0,0,0,0,0,0,0,0,0,0,0,0,0,0,0,0,0,0,0,0,0,0,0,0,0,0,0,0,0,0,0,0,0,0,0,0,0,0,0,0,0,0,0,0,null,null,null,null,null,null,null,null,null,null,null,null,null,null,null,null,null,"24S",null,null,null,null,null,null,null,{"$f":"IF($C$111=$B$112,CA$121,IF($C$111=$B$113,CA$122,IF($C$111=$B$114,CA$123,\"\")))","v":0}]
[0,75,null,"26S","18N",null,0,0,0,0,0,0,0,0,0,0,0,0,0,0,0,0,0,0,0,0,0,0,0,0,0,0,0,0,0,0,0,0,0,0,0,0,0,0,0,0,0,0,0,0,0,0,0,0,0,0,0,0,0,0,0,0,0,0,0,0,0,0,0,0,0,0,0,0,0,0,0,0,0,0,0,0,0,0,0,0,0,0,0,0,0,0,0,0,0,0,0,0,0,0,0,0,0,0,0,null,null,null,null,null,null,null,null,null,null,null,null,null,null,null,null,null,"25S",null,null,null,null,null,null,null,{"$f":"IF($C$111=$B$112,CB$121,IF($C$111=$B$113,CB$122,IF($C$111=$B$114,CB$123,\"\")))","v":0}]
[0,76,null,"27S","17N",null,0,0,0,0,0,0,0,0,0,0,0,0,0,0,0,0,0,0,0,0,0,0,0,0,0,0,0,0,0,0,0,0,0,0,0,0,0,0,0,0,0,0,0,0,0,0,0,0,0,0,0,0,0,0,0,0,0,0,0,0,0,0,0,0,0,0,0,0,0,0,0,0,0,0,0,0,0,0,0,0,0,0,0,0,0,0,0,0,0,0,0,0,0,0,0,0,0,0,0,null,null,null,null,null,null,null,null,null,null,null,null,null,null,null,null,null,"26S",null,null,null,null,null,null,null,{"$f":"IF($C$111=$B$112,CC$121,IF($C$111=$B$113,CC$122,IF($C$111=$B$114,CC$123,\"\")))","v":0}]
[0,77,null,"28S","16N",null,0,0,0,0,0,0,0,0,0,0,0,0,0,0,0,0,0,0,0,0,0,0,0,0,0,0,0,0,0,0,0,0,0,0,0,0,0,0,0,0,0,0,0,0,0,0,0,0,0,0,0,0,0,0,0,0,0,0,0,0,0,0,0,0,0,0,0,0,0,0,0,0,0,0,0,0,0,0,0,0,0,0,0,0,0,0,0,0,0,0,0,0,0,0,0,0,0,0,0,null,null,null,null,null,null,null,null,null,null,null,null,null,null,null,null,null,"27S",null,null,null,null,null,null,null,{"$f":"IF($C$111=$B$112,CD$121,IF($C$111=$B$113,CD$122,IF($C$111=$B$114,CD$123,\"\")))","v":0}]
[0,78,null,"29S","15N",null,0,0,0,0,0,0,0,0,0,0,0,0,0,0,0,0,0,0,0,0,0,0,0,0,0,0,0,0,0,0,0,0,0,0,0,0,0,0,0,0,0,0,0,0,0,0,0,{"$f":"MIN(BB$125,$A204)","v":0},0,0,0,0,0,0,0,0,0,0,0,0,0,0,0,{"$f":"MIN(BR$125,$A204)","v":0},0,0,0,0,0,0,0,0,0,0,0,0,0,0,0,{"$f":"MIN(CH$125,$A204)","v":0},0,0,0,0,0,0,0,0,0,0,0,0,0,0,0,0,0,0,0,null,null,null,null,null,null,null,null,null,null,null,null,null,null,null,null,null,"28S",null,null,null,null,null,null,null,{"$f":"IF($C$111=$B$112,CE$121,IF($C$111=$B$113,CE$122,IF($C$111=$B$114,CE$123,\"\")))","v":0}]
[0,79,null,"30S","14N",null,0,0,0,0,0,0,0,0,0,0,0,0,0,0,0,0,0,0,0,0,0,0,0,0,0,0,0,0,0,0,0,0,{"$f":"MIN(AM$125,$A205)","v":0},0,0,0,0,0,0,0,0,0,0,0,0,0,0,0,0,0,0,0,0,0,0,0,0,0,0,0,0,0,0,0,0,0,0,0,0,0,0,0,0,0,0,0,0,0,0,0,0,0,0,0,0,0,0,0,0,0,0,0,0,0,0,{"$f":"MIN(CX$125,$A205)","v":0},0,0,0,null,null,null,null,null,null,null,null,null,null,null,null,null,null,null,null,null,"29S",null,null,null,null,null,null,null,{"$f":"IF($C$111=$B$112,CF$121,IF($C$111=$B$113,CF$122,IF($C$111=$B$114,CF$123,\"\")))","v":0}]
[0,80,null,"31S","13N",null,0,0,0,0,0,0,0,0,0,0,0,0,0,0,0,0,0,0,0,0,0,0,0,0,0,0,0,0,0,0,{"$f":"MIN(AK$125,$A206)","v":0},0,0,0,0,0,0,0,0,0,0,0,0,0,0,0,0,0,0,0,0,0,0,0,0,0,0,0,0,0,0,0,0,0,0,0,0,0,0,0,0,0,0,0,0,0,0,0,0,0,0,0,0,0,0,0,0,0,0,0,0,0,0,0,0,0,0,0,0,null,null,null,null,null,null,null,null,null,null,null,null,null,null,null,null,null,"30S",null,null,null,null,null,null,null,{"$f":"IF($C$111=$B$112,CG$121,IF($C$111=$B$113,CG$122,IF($C$111=$B$114,CG$123,\"\")))","v":0}]
[0,81,null,"32S","12N",null,0,0,0,0,0,0,0,0,0,0,0,0,0,0,0,0,{"$f":"MIN(W$125,$A207)","v":0},0,0,0,0,0,0,0,0,0,0,0,0,0,0,0,0,0,0,0,0,0,0,0,0,0,0,0,0,0,{"$f":"MIN(BA$125,$A207)","v":0},0,0,0,0,0,0,0,0,0,0,0,0,0,0,0,0,0,0,0,0,0,0,0,0,0,0,0,0,0,0,0,0,0,0,0,0,0,0,0,0,0,0,0,0,0,0,0,0,0,0,0,0,null,null,null,null,null,null,null,null,null,null,null,null,null,null,null,null,null,"31S",null,null,null,null,null,null,null,{"$f":"IF($C$111=$B$112,CH$121,IF($C$111=$B$113,CH$122,IF($C$111=$B$114,CH$123,\"\")))","v":0}]
[0,82,null,"33S","11N",null,{"$f":"MIN(G$125,$A208)","v":0},0,0,0,0,0,0,0,0,0,0,0,0,0,0,0,0,0,0,0,0,0,0,0,0,0,0,0,0,0,0,0,0,0,0,0,0,0,0,0,0,0,0,0,0,0,0,0,0,0,0,0,0,0,0,0,0,0,0,0,0,0,0,0,0,0,0,0,0,0,0,0,0,0,0,0,0,0,0,0,0,0,0,0,0,0,0,0,0,0,0,0,0,0,0,0,0,0,0,null,null,null,null,null,null,null,null,null,null,null,null,null,null,null,null,null,"32S",null,null,null,null,null,null,null,{"$f":"IF($C$111=$B$112,CI$121,IF($C$111=$B$113,CI$122,IF($C$111=$B$114,CI$123,\"\")))","v":0}]
[0,83,null,null,"10N",null,0,0,0,0,0,0,0,0,0,0,0,0,0,0,0,0,0,0,0,0,0,0,0,0,0,0,0,0,0,0,0,0,0,0,0,0,0,0,0,0,0,0,0,0,0,0,0,0,0,0,0,0,0,0,0,0,0,0,0,0,0,0,0,0,0,0,0,0,0,0,0,0,0,0,0,0,0,0,0,0,0,0,0,0,0,0,0,0,0,0,0,0,0,0,0,0,0,0,0,null,null,null,null,null,null,null,null,null,null,null,null,null,null,null,null,null,"33S",null,null,null,null,null,null,null,{"$f":"IF($C$111=$B$112,CJ$121,IF($C$111=$B$113,CJ$122,IF($C$111=$B$114,CJ$123,\"\")))","v":0}]
[0,84,null,null,"9N",null,0,0,0,0,0,0,0,0,0,0,0,0,0,0,0,0,0,0,0,0,0,0,0,0,0,0,0,0,0,0,0,0,0,0,0,0,0,0,0,0,0,0,0,0,0,0,0,0,0,0,0,0,0,0,0,0,0,0,0,0,0,0,0,0,0,0,0,0,0,0,0,0,0,0,0,0,0,0,0,0,0,0,0,0,0,0,0,0,0,0,0,0,0,0,0,0,0,0,0,null,null,null,null,null,null,null,null,null,null,null,null,null,null,null,null,null,0,null,null,null,null,null,null,null,{"$f":"IF($C$111=$B$112,CK$121,IF($C$111=$B$113,CK$122,IF($C$111=$B$114,CK$123,\"\")))","v":0}]
[0,85,null,null,"8N",null,0,0,0,0,0,0,0,0,0,0,0,0,0,0,0,0,0,0,0,0,0,0,0,0,0,0,0,0,0,0,0,0,0,0,0,0,0,0,0,0,0,0,0,0,0,0,0,0,0,0,0,0,0,0,0,0,0,0,0,0,0,0,0,0,0,0,0,0,0,0,0,0,0,0,0,0,0,0,0,0,0,0,0,0,0,0,0,0,0,0,0,0,0,0,0,0,0,0,0,null,null,null,null,null,null,null,null,null,null,null,null,null,null,null,null,null,0,null,null,null,null,null,null,null,{"$f":"IF($C$111=$B$112,CL$121,IF($C$111=$B$113,CL$122,IF($C$111=$B$114,CL$123,\"\")))","v":0}]
[0,86,null,null,"7N",null,0,0,0,0,0,0,0,0,0,0,0,0,0,0,0,0,0,0,0,0,0,0,0,0,0,0,0,0,0,0,0,0,0,0,0,0,0,0,0,0,0,0,0,0,0,0,0,0,0,0,0,0,0,0,0,0,0,0,0,0,0,0,0,0,0,0,0,0,0,0,0,0,0,0,0,0,0,0,0,0,0,0,0,0,0,0,0,0,0,0,0,0,0,0,0,0,0,0,0,null,null,null,null,null,null,null,null,null,null,null,null,null,null,null,null,null,0,null,null,null,null,null,null,null,{"$f":"IF($C$111=$B$112,CM$121,IF($C$111=$B$113,CM$122,IF($C$111=$B$114,CM$123,\"\")))","v":0}]
[0,87,null,null,"6N",null,0,0,0,0,0,0,0,0,0,0,0,0,0,0,0,0,0,0,0,0,0,0,0,0,0,0,0,0,0,0,0,0,0,0,0,0,0,0,0,0,0,0,0,0,0,0,0,0,0,0,0,0,0,0,0,0,0,0,0,0,0,0,0,0,0,0,0,0,0,0,0,0,0,0,0,0,0,0,0,0,0,0,0,0,0,0,0,0,0,0,0,0,0,0,0,0,0,0,0,null,null,null,null,null,null,null,null,null,null,null,null,null,null,null,null,null,0,null,null,null,null,null,null,null,{"$f":"IF($C$111=$B$112,CN$121,IF($C$111=$B$113,CN$122,IF($C$111=$B$114,CN$123,\"\")))","v":0}]
[0,88,null,null,"5N",null,0,0,0,0,0,0,0,0,0,0,0,0,0,0,0,0,0,0,0,0,0,0,0,0,0,0,0,0,0,0,0,0,0,0,0,0,0,0,0,0,0,0,0,0,0,0,0,0,0,0,0,0,0,0,0,0,0,0,0,0,0,0,0,0,0,0,0,0,0,0,0,0,0,0,0,0,0,0,0,0,0,0,0,0,0,0,0,0,0,0,0,0,0,0,0,0,0,0,0,null,null,null,null,null,null,null,null,null,null,null,null,null,null,null,null,null,0,null,null,null,null,null,null,null,{"$f":"IF($C$111=$B$112,CO$121,IF($C$111=$B$113,CO$122,IF($C$111=$B$114,CO$123,\"\")))","v":0}]
[0,89,null,null,"4N",null,0,0,0,0,0,0,0,0,0,0,0,0,0,0,0,0,0,0,0,0,0,0,0,0,0,0,0,0,0,0,0,0,0,0,0,0,0,0,0,0,0,0,0,0,0,0,0,0,0,0,0,0,0,0,0,0,0,0,0,0,0,0,0,0,0,0,0,0,0,0,0,0,0,0,0,0,0,0,0,0,0,0,0,0,0,0,0,0,0,0,0,0,0,0,0,0,0,0,0,null,null,null,null,null,null,null,null,null,null,null,null,null,null,null,null,null,0,null,null,null,null,null,null,null,{"$f":"IF($C$111=$B$112,CP$121,IF($C$111=$B$113,CP$122,IF($C$111=$B$114,CP$123,\"\")))","v":0}]
[0,90,null,null,"3N",null,0,0,0,0,0,0,0,0,0,0,0,0,0,0,0,0,0,0,0,0,0,0,0,0,0,0,0,0,0,0,0,0,0,0,0,0,0,0,0,0,0,0,0,0,0,0,0,0,0,0,0,0,0,0,0,0,0,0,0,0,0,0,0,0,0,0,0,0,0,0,0,0,0,0,0,0,0,0,0,0,0,0,0,0,0,0,0,0,0,0,0,0,0,0,0,0,0,0,0,null,null,null,null,null,null,null,null,null,null,null,null,null,null,null,null,null,0,null,null,null,null,null,null,null,{"$f":"IF($C$111=$B$112,CQ$121,IF($C$111=$B$113,CQ$122,IF($C$111=$B$114,CQ$123,\"\")))","v":0}]
[0,91,null,null,"2N",null,0,0,0,0,0,0,0,0,0,0,0,0,0,0,0,0,0,0,0,0,0,0,0,0,0,0,0,0,0,0,0,0,0,0,0,0,0,0,0,0,0,0,0,0,0,0,0,0,0,0,0,0,0,0,0,0,0,0,0,0,0,0,0,0,0,0,0,0,0,0,0,0,0,0,0,0,0,0,0,0,0,0,0,0,0,0,0,0,0,0,0,0,0,0,0,0,0,0,0,null,null,null,null,null,null,null,null,null,null,null,null,null,null,null,null,null,0,null,null,null,null,null,null,null,{"$f":"IF($C$111=$B$112,CR$121,IF($C$111=$B$113,CR$122,IF($C$111=$B$114,CR$123,\"\")))","v":0}]
[0,92,null,null,"1N",null,0,0,0,0,0,0,0,0,0,0,0,0,0,0,0,0,0,0,0,0,0,0,0,0,0,0,0,0,0,0,0,0,0,0,0,0,0,0,0,0,0,0,0,0,0,0,0,0,0,0,0,0,0,0,0,0,0,0,0,0,0,0,0,0,0,0,0,0,0,0,0,0,0,0,0,0,0,0,0,0,0,0,0,0,0,0,0,0,0,0,0,0,0,0,0,0,0,0,0,null,null,null,null,null,null,null,null,null,null,null,null,null,null,null,null,null,0,null,null,null,null,null,null,null,{"$f":"IF($C$111=$B$112,CS$121,IF($C$111=$B$113,CS$122,IF($C$111=$B$114,CS$123,\"\")))","v":0}]
[0,93,null,null,"1S",null,0,0,0,0,0,0,0,0,0,0,0,0,0,0,0,0,0,0,0,0,0,0,0,0,0,0,0,0,0,0,0,0,0,0,0,0,0,0,0,0,0,0,0,0,0,0,0,0,0,0,0,0,0,0,0,0,0,0,0,0,0,0,0,0,0,0,0,0,0,0,0,0,0,0,0,0,0,0,0,0,0,0,0,0,0,0,0,0,0,0,0,0,0,0,0,0,0,0,0,null,null,null,null,null,null,null,null,null,null,null,null,null,null,null,null,null,0,null,null,null,null,null,null,null,{"$f":"IF($C$111=$B$112,CT$121,IF($C$111=$B$113,CT$122,IF($C$111=$B$114,CT$123,\"\")))","v":0}]
[0,94,null,null,"2S",null,0,0,0,0,0,0,0,0,0,0,0,0,0,0,0,0,0,0,0,0,0,0,0,0,0,0,0,0,0,0,0,0,0,0,0,0,0,0,0,0,0,0,0,0,0,0,0,{"$f":"MIN(BB$125,$A220)","v":0},0,0,0,0,0,0,0,0,0,0,0,0,0,0,{"$f":"MIN(BQ$125,$A220)","v":0},0,0,0,0,0,0,0,0,0,0,0,0,0,0,0,{"$f":"MIN(CG$125,$A220)","v":0},0,0,0,0,0,0,0,0,0,0,0,0,0,0,0,{"$f":"MIN(CW$125,$A220)","v":0},0,0,0,0,null,null,null,null,null,null,null,null,null,null,null,null,null,null,null,null,null,0,null,null,null,null,null,null,null,{"$f":"IF($C$111=$B$112,CU$121,IF($C$111=$B$113,CU$122,IF($C$111=$B$114,CU$123,\"\")))","v":0}]
[0,95,null,null,"3S",null,0,0,0,0,0,0,0,0,0,0,0,0,0,0,0,0,0,0,0,0,0,0,0,0,0,0,0,0,0,0,0,0,0,0,0,0,0,0,0,0,0,0,0,0,0,0,0,0,0,0,0,0,0,0,0,0,0,0,0,0,0,0,0,0,0,0,0,0,0,0,0,0,0,0,0,0,0,0,0,0,0,0,0,0,0,0,0,0,0,0,0,0,0,0,0,0,0,0,0,null,null,null,null,null,null,null,null,null,null,null,null,null,null,null,null,null,0,null,null,null,null,null,null,null,{"$f":"IF($C$111=$B$112,CV$121,IF($C$111=$B$113,CV$122,IF($C$111=$B$114,CV$123,\"\")))","v":0}]
[0,96,null,null,"4S",null,0,0,0,0,0,0,0,0,0,0,0,0,0,0,0,0,0,0,0,0,0,0,0,0,0,0,0,0,0,0,0,0,{"$f":"MIN(AM$125,$A222)","v":0},0,0,0,0,0,0,0,0,0,0,0,0,0,0,0,0,0,0,0,0,0,0,0,0,0,0,0,0,0,0,0,0,0,0,0,0,0,0,0,0,0,0,0,0,0,0,0,0,0,0,0,0,0,0,0,0,0,0,0,0,0,0,0,0,0,0,null,null,null,null,null,null,null,null,null,null,null,null,null,null,null,null,null,0,null,null,null,null,null,null,null,{"$f":"IF($C$111=$B$112,CW$121,IF($C$111=$B$113,CW$122,IF($C$111=$B$114,CW$123,\"\")))","v":0}]
[0,97,null,null,"5S",null,0,0,0,0,0,0,0,0,0,0,0,0,0,0,0,{"$f":"MIN(V$125,$A223)","v":0},0,0,0,0,0,0,0,0,0,0,0,0,0,0,0,{"$f":"MIN(AL$125,$A223)","v":0},0,0,0,0,0,0,0,0,0,0,0,0,0,0,0,0,{"$f":"MIN(BC$125,$A223)","v":0},0,0,0,0,0,0,0,0,0,0,0,0,0,0,0,0,0,0,0,0,0,0,0,0,0,0,0,0,0,0,0,0,0,0,0,0,0,0,0,0,0,0,0,0,0,0,0,0,0,0,null,null,null,null,null,null,null,null,null,null,null,null,null,null,null,null,null,0,null,null,null,null,null,null,null,{"$f":"IF($C$111=$B$112,CX$121,IF($C$111=$B$113,CX$122,IF($C$111=$B$114,CX$123,\"\")))","v":0}]
[0,98,null,null,"6S",null,{"$f":"MIN(G$125,$A224)","v":0},0,0,0,0,0,0,0,0,0,0,0,0,0,0,0,0,0,0,0,0,0,0,0,0,0,0,0,0,0,0,0,0,0,0,0,0,0,0,0,0,0,0,0,0,0,0,0,0,0,0,0,0,0,0,0,0,0,0,0,0,0,0,0,0,0,0,0,0,0,0,0,0,0,0,0,0,0,0,0,0,0,0,0,0,0,0,0,0,0,0,0,0,0,0,0,0,0,0,null,null,null,null,null,null,null,null,null,null,null,null,null,null,null,null,null,{"$f":"IF($C$111=$B$112,C223,IF($C$111=$B$113,D223,IF($C$111=$B$114,E223,\"\")))","v":0},null,null,null,null,null,null,null,{"$f":"IF($C$111=$B$112,CY$121,IF($C$111=$B$113,CY$122,IF($C$111=$B$114,CY$123,\"\")))","v":0}]
[0,99,null,null,"7S",null,0,0,0,0,0,0,0,0,0,0,0,0,0,0,0,0,0,0,0,0,0,0,0,0,0,0,0,0,0,0,0,0,0,0,0,0,0,0,0,0,0,0,0,0,0,0,0,0,0,0,0,0,0,0,0,0,0,0,0,0,0,0,0,0,0,0,0,0,0,0,0,0,0,0,0,0,0,0,0,0,0,0,0,0,0,0,0,0,0,0,0,0,0,0,0,0,0,0,0,null,null,null,null,null,null,null,null,null,null,null,null,null,null,null,null,null,0,null,null,null,null,null,null,null,{"$f":"IF($C$111=$B$112,CZ$121,IF($C$111=$B$113,CZ$122,IF($C$111=$B$114,CZ$123,\"\")))","v":0}]
[0,100,null,null,"8S",null,0,0,0,0,0,0,0,0,0,0,0,0,0,0,0,0,0,0,0,0,0,0,0,0,0,0,0,0,0,0,0,0,0,0,0,0,0,0,0,0,0,0,0,0,0,0,0,0,0,0,0,0,0,0,0,0,0,0,0,0,0,0,0,0,0,0,0,0,0,0,0,0,0,0,0,0,0,0,0,0,0,0,0,0,0,0,0,0,0,0,0,0,0,0,0,0,0,0,0,null,null,null,null,null,null,null,null,null,null,null,null,null,null,null,null,null,0,null,null,null,null,null,null,null,{"$f":"IF($C$111=$B$112,DA$121,IF($C$111=$B$113,DA$122,IF($C$111=$B$114,DA$123,\"\")))","v":0}]
[0,101,null,null,"9S",null,0,0,0,0,0,0,0,0,0,0,0,0,0,0,0,0,0,0,0,0,0,0,0,0,0,0,0,0,0,0,0,0,0,0,0,0,0,0,0,0,0,0,0,0,0,0,0,0,0,0,0,0,0,0,0,0,0,0,0,0,0,0,0,0,0,0,0,0,0,0,0,0,0,0,0,0,0,0,0,0,0,0,0,0,0,0,0,0,0,0,0,0,0,0,0,0,0,0,0,null,null,null,null,null,null,null,null,null,null,null,null,null,null,null,null,null,0]
[0,102,null,null,"10S",null,0,0,0,0,0,0,0,0,0,0,0,0,0,0,0,0,0,0,0,0,0,0,0,0,0,0,0,0,0,0,0,0,0,0,0,0,0,0,0,0,0,0,0,0,0,0,0,0,0,0,0,0,0,0,0,0,0,0,0,0,0,0,0,0,0,0,0,0,0,0,0,0,0,0,0,0,0,0,0,0,0,0,0,0,0,0,0,0,0,0,0,0,0,0,0,0,0,0,0,null,null,null,null,null,null,null,null,null,null,null,null,null,null,null,null,null,0]
[0,103,null,null,"11S",null,0,0,0,0,0,0,0,0,0,0,0,0,0,0,0,0,0,0,0,0,0,0,0,0,0,0,0,0,0,0,0,0,0,0,0,0,0,0,0,0,0,0,0,0,0,0,0,0,0,0,0,0,0,0,0,0,0,0,0,0,0,0,0,0,0,0,0,0,0,0,0,0,0,0,0,0,0,0,0,0,0,0,0,0,0,0,0,0,0,0,0,0,0,0,0,0,0,0,0,null,null,null,null,null,null,null,null,null,null,null,null,null,null,null,null,null,0]
[0,104,null,null,"12S",null,0,0,0,0,0,0,0,0,0,0,0,0,0,0,0,0,0,0,0,0,0,0,0,0,0,0,0,0,0,0,0,0,0,0,0,0,0,0,0,0,0,0,0,0,0,0,0,0,0,0,0,0,0,0,0,0,0,0,0,0,0,0,0,0,0,0,0,0,0,0,0,0,0,0,0,0,0,0,0,0,0,0,0,0,0,0,0,0,0,0,0,0,0,0,0,0,0,0,0,null,null,null,null,null,null,null,null,null,null,null,null,null,null,null,null,null,0]
[0,105,null,null,"13S",null,0,0,0,0,0,0,0,0,0,0,0,0,0,0,0,0,0,0,0,0,0,0,0,0,0,0,0,0,0,0,0,0,0,0,0,0,0,0,0,0,0,0,0,0,0,0,0,0,0,0,0,0,0,0,0,0,0,0,0,0,0,0,0,0,0,0,0,0,0,0,0,0,0,0,0,0,0,0,0,0,0,0,0,0,0,0,0,0,0,0,0,0,0,0,0,0,0,0,0,null,null,null,null,null,null,null,null,null,null,null,null,null,null,null,null,null,0]
[0,106,null,null,"14S",null,0,0,0,0,0,0,0,0,0,0,0,0,0,0,0,0,0,0,0,0,0,0,0,0,0,0,0,0,0,0,0,0,0,0,0,0,0,0,0,0,0,0,0,0,0,0,0,0,0,0,0,0,0,0,0,0,0,0,0,0,0,0,0,0,0,0,0,0,0,0,0,0,0,0,0,0,0,0,0,0,0,0,0,0,0,0,0,0,0,0,0,0,0,0,0,0,0,0,0,null,null,null,null,null,null,null,null,null,null,null,null,null,null,null,null,null,0]
[0,107,null,null,"15S",null,0,0,0,0,0,0,0,0,0,0,0,0,0,0,0,0,0,0,0,0,0,0,0,0,0,0,0,0,0,0,0,0,0,0,0,0,0,0,0,0,0,0,0,0,0,0,0,0,0,0,0,0,0,0,0,0,0,0,0,0,0,0,0,0,0,0,0,0,0,0,0,0,0,0,0,0,0,0,0,0,0,0,0,0,0,0,0,0,0,0,0,0,0,0,0,0,0,0,0,null,null,null,null,null,null,null,null,null,null,null,null,null,null,null,null,null,0]
[0,108,null,null,"16S",null,0,0,0,0,0,0,0,0,0,0,0,0,0,0,0,0,0,0,0,0,0,0,0,0,0,0,0,0,0,0,0,0,0,0,0,0,0,0,0,0,0,0,0,0,0,0,0,0,0,0,0,0,0,0,0,0,0,0,0,0,0,0,0,0,0,0,0,0,0,0,0,0,0,0,0,0,0,0,0,0,0,0,0,0,0,0,0,0,0,0,0,0,0,0,0,0,0,0,0,null,null,null,null,null,null,null,null,null,null,null,null,null,null,null,null,null,0]
[0,109,null,null,"17S",null,0,0,0,0,0,0,0,0,0,0,0,0,0,0,0,0,0,0,0,0,0,0,0,0,0,0,0,0,0,0,0,0,0,0,0,0,0,0,0,0,0,0,0,0,0,0,0,0,0,0,0,0,0,0,0,0,0,0,0,0,0,0,0,0,0,0,0,0,0,0,0,0,0,0,0,0,0,{"$f":"MIN(CF$125,$A235)","v":0},0,0,0,0,0,0,0,0,0,0,0,0,0,0,0,{"$f":"MIN(CV$125,$A235)","v":0},0,0,0,0,0,null,null,null,null,null,null,null,null,null,null,null,null,null,null,null,null,null,0]
[0,110,null,null,"18S",null,0,0,0,0,0,0,0,0,0,0,0,0,0,0,0,0,0,0,0,0,0,0,0,0,0,0,0,0,0,0,0,0,0,0,0,0,0,0,0,0,0,0,0,0,0,0,0,0,0,0,0,0,0,0,0,0,0,0,0,0,0,0,0,0,{"$f":"MIN(BS$125,$A236)","v":0},0,0,0,0,0,0,0,0,0,0,0,0,0,0,0,0,0,0,0,0,0,0,0,0,0,0,0,0,0,0,0,0,0,0,null,null,null,null,null,null,null,null,null,null,null,null,null,null,null,null,null,0]
[0,111,null,null,"19S",null,0,0,0,0,0,0,0,0,0,0,0,0,0,0,0,0,0,0,0,0,0,0,0,0,0,0,0,0,0,0,0,0,0,0,0,0,0,0,0,0,0,0,0,0,0,0,0,0,0,0,0,0,0,0,0,0,0,0,0,0,0,0,0,0,0,0,0,0,0,0,0,0,0,0,0,0,0,0,0,0,0,0,0,0,0,0,0,0,0,0,0,0,0,0,0,0,0,0,0,null,null,null,null,null,null,null,null,null,null,null,null,null,null,null,null,null,0]

{"sheet":"Reporting","index":9,"n_rows":1,"n_cols":19,"rows_kept":1,"cut":false,"hidden":true,"merged":[]}
["Applicant","Date","Soil","Crop","Township Cell","RangeCell","Practice","Perched Water","Before Use","After Use","Life Ex.","Project Cost","Acreage","IWM Cell Level","Annual Water Savings (in)","Score","Ranker","Peak Daily ET (in)","Reviewed"]

{"sheet":"Password","index":10,"n_rows":2,"n_cols":2,"rows_kept":2,"cut":false,"hidden":true,"merged":[]}
["Unprotect Workbook","newuser1"]
["Unprotect Worksheet","newuser1"]